{"text_format":"1","workbook":"xlsx","n_sheets":2,"sheets":["Tabelle1","Tabelle2"],"not_rendered":{"charts":0,"images":1,"macros":1,"external_links":0,"defined_names":0,"comments":0,"pivot_tables":0},"unopened":[],"bounds":{"document_bytes":16777216,"sheet_cells":100000,"rows_first":2000,"rows_last":500,"rows_between":2000,"halvings":0,"cell_chars":16384,"cell_head_chars":4096},"cells_cut":0,"cells_raw":0,"read":"whole","date_system":"1900"}

{"sheet":"Tabelle1","index":0,"n_rows":15,"n_cols":8,"rows_kept":15,"cut":false,"hidden":false,"merged":[]}
[]
["Name","WKN","ISIN","lfd. J.","1J.","3J.","5J.","10J."]
["iShares Core MSCI World UCITS ETF USD (Acc)","A0RPWH","IE00B4L5Y983",{"$f":"IFERROR(MID(VLOOKUP($C3,Tabelle2!$C:$D,2,FALSE),FIND(\"#\",SUBSTITUTE(VLOOKUP($C3,Tabelle2!$C:$D,2,FALSE),\"\"\">\",\"#\",IF(ISERROR(SEARCH(\"EUR\",$A3)),2,1)))+2,FIND(\"%\",MID(VLOOKUP($C3,Tabelle2!$C:$D,2,FALSE),FIND(\"#\",SUBSTITUTE(VLOOKUP($C3,Tabelle2!$C:$D,2,FALSE),\"\"\">\",\"#\",IF(ISERROR(SEARCH(\"EUR\",$A3)),2,1)))+2,10))-1)/100,\"\")","v":0.10529999999999999},{"$f":"IFERROR(MID(VLOOKUP($C3,Tabelle2!$C:$D,2,FALSE),FIND(\"#\",SUBSTITUTE(VLOOKUP($C3,Tabelle2!$C:$D,2,FALSE),\"\"\">\",\"#\",IF(ISERROR(SEARCH(\"EUR\",$A3)),5,3)))+2,FIND(\"%\",MID(VLOOKUP($C3,Tabelle2!$C:$D,2,FALSE),FIND(\"#\",SUBSTITUTE(VLOOKUP($C3,Tabelle2!$C:$D,2,FALSE),\"\"\">\",\"#\",IF(ISERROR(SEARCH(\"EUR\",$A3)),5,3)))+2,10))-1)/100,\"\")","v":9.820000000000001E-2},{"$f":"IFERROR(MID(VLOOKUP($C3,Tabelle2!$C:$D,2,FALSE),FIND(\"#\",SUBSTITUTE(VLOOKUP($C3,Tabelle2!$C:$D,2,FALSE),\"\"\">\",\"#\",IF(ISERROR(SEARCH(\"EUR\",$A3)),8,5)))+2,FIND(\"%\",MID(VLOOKUP($C3,Tabelle2!$C:$D,2,FALSE),FIND(\"#\",SUBSTITUTE(VLOOKUP($C3,Tabelle2!$C:$D,2,FALSE),\"\"\">\",\"#\",IF(ISERROR(SEARCH(\"EUR\",$A3)),8,5)))+2,10))-1)/100,\"\")","v":0.4632},{"$f":"IFERROR(MID(VLOOKUP($C3,Tabelle2!$C:$D,2,FALSE),FIND(\"#\",SUBSTITUTE(VLOOKUP($C3,Tabelle2!$C:$D,2,FALSE),\"\"\">\",\"#\",IF(ISERROR(SEARCH(\"EUR\",$A3)),11,7)))+2,FIND(\"%\",MID(VLOOKUP($C3,Tabelle2!$C:$D,2,FALSE),FIND(\"#\",SUBSTITUTE(VLOOKUP($C3,Tabelle2!$C:$D,2,FALSE),\"\"\">\",\"#\",IF(ISERROR(SEARCH(\"EUR\",$A3)),11,7)))+2,11))-1)/100,\"\")","v":0.67390000000000005},{"$f":"IFERROR(MID(VLOOKUP($C3,Tabelle2!$C:$D,2,FALSE),FIND(\"#\",SUBSTITUTE(VLOOKUP($C3,Tabelle2!$C:$D,2,FALSE),\"\"\">\",\"#\",IF(ISERROR(SEARCH(\"EUR\",$A3)),14,9)))+2,FIND(\"%\",MID(VLOOKUP($C3,Tabelle2!$C:$D,2,FALSE),FIND(\"#\",SUBSTITUTE(VLOOKUP($C3,Tabelle2!$C:$D,2,FALSE),\"\"\">\",\"#\",IF(ISERROR(SEARCH(\"EUR\",$A3)),14,9)))+2,11))-1)/100,\"\")","v":""}]
["ComStage MSCI World TRN UCITS ETF","ETF110","LU0392494562",{"$f":"IFERROR(MID(VLOOKUP($C4,Tabelle2!$C:$D,2,FALSE),FIND(\"#\",SUBSTITUTE(VLOOKUP($C4,Tabelle2!$C:$D,2,FALSE),\"\"\">\",\"#\",IF(ISERROR(SEARCH(\"EUR\",$A4)),2,1)))+2,FIND(\"%\",MID(VLOOKUP($C4,Tabelle2!$C:$D,2,FALSE),FIND(\"#\",SUBSTITUTE(VLOOKUP($C4,Tabelle2!$C:$D,2,FALSE),\"\"\">\",\"#\",IF(ISERROR(SEARCH(\"EUR\",$A4)),2,1)))+2,10))-1)/100,\"\")","v":0.11349999999999999},{"$f":"IFERROR(MID(VLOOKUP($C4,Tabelle2!$C:$D,2,FALSE),FIND(\"#\",SUBSTITUTE(VLOOKUP($C4,Tabelle2!$C:$D,2,FALSE),\"\"\">\",\"#\",IF(ISERROR(SEARCH(\"EUR\",$A4)),5,3)))+2,FIND(\"%\",MID(VLOOKUP($C4,Tabelle2!$C:$D,2,FALSE),FIND(\"#\",SUBSTITUTE(VLOOKUP($C4,Tabelle2!$C:$D,2,FALSE),\"\"\">\",\"#\",IF(ISERROR(SEARCH(\"EUR\",$A4)),5,3)))+2,10))-1)/100,\"\")","v":9.9100000000000008E-2},{"$f":"IFERROR(MID(VLOOKUP($C4,Tabelle2!$C:$D,2,FALSE),FIND(\"#\",SUBSTITUTE(VLOOKUP($C4,Tabelle2!$C:$D,2,FALSE),\"\"\">\",\"#\",IF(ISERROR(SEARCH(\"EUR\",$A4)),8,5)))+2,FIND(\"%\",MID(VLOOKUP($C4,Tabelle2!$C:$D,2,FALSE),FIND(\"#\",SUBSTITUTE(VLOOKUP($C4,Tabelle2!$C:$D,2,FALSE),\"\"\">\",\"#\",IF(ISERROR(SEARCH(\"EUR\",$A4)),8,5)))+2,10))-1)/100,\"\")","v":0.46200000000000002},{"$f":"IFERROR(MID(VLOOKUP($C4,Tabelle2!$C:$D,2,FALSE),FIND(\"#\",SUBSTITUTE(VLOOKUP($C4,Tabelle2!$C:$D,2,FALSE),\"\"\">\",\"#\",IF(ISERROR(SEARCH(\"EUR\",$A4)),11,7)))+2,FIND(\"%\",MID(VLOOKUP($C4,Tabelle2!$C:$D,2,FALSE),FIND(\"#\",SUBSTITUTE(VLOOKUP($C4,Tabelle2!$C:$D,2,FALSE),\"\"\">\",\"#\",IF(ISERROR(SEARCH(\"EUR\",$A4)),11,7)))+2,11))-1)/100,\"\")","v":0.66659999999999997},{"$f":"IFERROR(MID(VLOOKUP($C4,Tabelle2!$C:$D,2,FALSE),FIND(\"#\",SUBSTITUTE(VLOOKUP($C4,Tabelle2!$C:$D,2,FALSE),\"\"\">\",\"#\",IF(ISERROR(SEARCH(\"EUR\",$A4)),14,9)))+2,FIND(\"%\",MID(VLOOKUP($C4,Tabelle2!$C:$D,2,FALSE),FIND(\"#\",SUBSTITUTE(VLOOKUP($C4,Tabelle2!$C:$D,2,FALSE),\"\"\">\",\"#\",IF(ISERROR(SEARCH(\"EUR\",$A4)),14,9)))+2,11))-1)/100,\"\")","v":2.4156999999999997}]
["Lyxor MSCI World UCITS ETF D-EUR","LYX0AG","FR0010315770",{"$f":"IFERROR(MID(VLOOKUP($C5,Tabelle2!$C:$D,2,FALSE),FIND(\"#\",SUBSTITUTE(VLOOKUP($C5,Tabelle2!$C:$D,2,FALSE),\"\"\">\",\"#\",IF(ISERROR(SEARCH(\"EUR\",$A5)),2,1)))+2,FIND(\"%\",MID(VLOOKUP($C5,Tabelle2!$C:$D,2,FALSE),FIND(\"#\",SUBSTITUTE(VLOOKUP($C5,Tabelle2!$C:$D,2,FALSE),\"\"\">\",\"#\",IF(ISERROR(SEARCH(\"EUR\",$A5)),2,1)))+2,10))-1)/100,\"\")","v":0.1051},{"$f":"IFERROR(MID(VLOOKUP($C5,Tabelle2!$C:$D,2,FALSE),FIND(\"#\",SUBSTITUTE(VLOOKUP($C5,Tabelle2!$C:$D,2,FALSE),\"\"\">\",\"#\",IF(ISERROR(SEARCH(\"EUR\",$A5)),5,3)))+2,FIND(\"%\",MID(VLOOKUP($C5,Tabelle2!$C:$D,2,FALSE),FIND(\"#\",SUBSTITUTE(VLOOKUP($C5,Tabelle2!$C:$D,2,FALSE),\"\"\">\",\"#\",IF(ISERROR(SEARCH(\"EUR\",$A5)),5,3)))+2,10))-1)/100,\"\")","v":0.1013},{"$f":"IFERROR(MID(VLOOKUP($C5,Tabelle2!$C:$D,2,FALSE),FIND(\"#\",SUBSTITUTE(VLOOKUP($C5,Tabelle2!$C:$D,2,FALSE),\"\"\">\",\"#\",IF(ISERROR(SEARCH(\"EUR\",$A5)),8,5)))+2,FIND(\"%\",MID(VLOOKUP($C5,Tabelle2!$C:$D,2,FALSE),FIND(\"#\",SUBSTITUTE(VLOOKUP($C5,Tabelle2!$C:$D,2,FALSE),\"\"\">\",\"#\",IF(ISERROR(SEARCH(\"EUR\",$A5)),8,5)))+2,10))-1)/100,\"\")","v":0.4592},{"$f":"IFERROR(MID(VLOOKUP($C5,Tabelle2!$C:$D,2,FALSE),FIND(\"#\",SUBSTITUTE(VLOOKUP($C5,Tabelle2!$C:$D,2,FALSE),\"\"\">\",\"#\",IF(ISERROR(SEARCH(\"EUR\",$A5)),11,7)))+2,FIND(\"%\",MID(VLOOKUP($C5,Tabelle2!$C:$D,2,FALSE),FIND(\"#\",SUBSTITUTE(VLOOKUP($C5,Tabelle2!$C:$D,2,FALSE),\"\"\">\",\"#\",IF(ISERROR(SEARCH(\"EUR\",$A5)),11,7)))+2,11))-1)/100,\"\")","v":0.66739999999999999},{"$f":"IFERROR(MID(VLOOKUP($C5,Tabelle2!$C:$D,2,FALSE),FIND(\"#\",SUBSTITUTE(VLOOKUP($C5,Tabelle2!$C:$D,2,FALSE),\"\"\">\",\"#\",IF(ISERROR(SEARCH(\"EUR\",$A5)),14,9)))+2,FIND(\"%\",MID(VLOOKUP($C5,Tabelle2!$C:$D,2,FALSE),FIND(\"#\",SUBSTITUTE(VLOOKUP($C5,Tabelle2!$C:$D,2,FALSE),\"\"\">\",\"#\",IF(ISERROR(SEARCH(\"EUR\",$A5)),14,9)))+2,11))-1)/100,\"\")","v":2.3515000000000001}]
["HSBC MSCI WORLD UCITS ETF","A1C9KL","DE000A1C9KL8",{"$f":"IFERROR(MID(VLOOKUP($C6,Tabelle2!$C:$D,2,FALSE),FIND(\"#\",SUBSTITUTE(VLOOKUP($C6,Tabelle2!$C:$D,2,FALSE),\"\"\">\",\"#\",IF(ISERROR(SEARCH(\"EUR\",$A6)),2,1)))+2,FIND(\"%\",MID(VLOOKUP($C6,Tabelle2!$C:$D,2,FALSE),FIND(\"#\",SUBSTITUTE(VLOOKUP($C6,Tabelle2!$C:$D,2,FALSE),\"\"\">\",\"#\",IF(ISERROR(SEARCH(\"EUR\",$A6)),2,1)))+2,10))-1)/100,\"\")","v":0.10529999999999999},{"$f":"IFERROR(MID(VLOOKUP($C6,Tabelle2!$C:$D,2,FALSE),FIND(\"#\",SUBSTITUTE(VLOOKUP($C6,Tabelle2!$C:$D,2,FALSE),\"\"\">\",\"#\",IF(ISERROR(SEARCH(\"EUR\",$A6)),5,3)))+2,FIND(\"%\",MID(VLOOKUP($C6,Tabelle2!$C:$D,2,FALSE),FIND(\"#\",SUBSTITUTE(VLOOKUP($C6,Tabelle2!$C:$D,2,FALSE),\"\"\">\",\"#\",IF(ISERROR(SEARCH(\"EUR\",$A6)),5,3)))+2,10))-1)/100,\"\")","v":0.10220000000000001},{"$f":"IFERROR(MID(VLOOKUP($C6,Tabelle2!$C:$D,2,FALSE),FIND(\"#\",SUBSTITUTE(VLOOKUP($C6,Tabelle2!$C:$D,2,FALSE),\"\"\">\",\"#\",IF(ISERROR(SEARCH(\"EUR\",$A6)),8,5)))+2,FIND(\"%\",MID(VLOOKUP($C6,Tabelle2!$C:$D,2,FALSE),FIND(\"#\",SUBSTITUTE(VLOOKUP($C6,Tabelle2!$C:$D,2,FALSE),\"\"\">\",\"#\",IF(ISERROR(SEARCH(\"EUR\",$A6)),8,5)))+2,10))-1)/100,\"\")","v":0.47200000000000003},{"$f":"IFERROR(MID(VLOOKUP($C6,Tabelle2!$C:$D,2,FALSE),FIND(\"#\",SUBSTITUTE(VLOOKUP($C6,Tabelle2!$C:$D,2,FALSE),\"\"\">\",\"#\",IF(ISERROR(SEARCH(\"EUR\",$A6)),11,7)))+2,FIND(\"%\",MID(VLOOKUP($C6,Tabelle2!$C:$D,2,FALSE),FIND(\"#\",SUBSTITUTE(VLOOKUP($C6,Tabelle2!$C:$D,2,FALSE),\"\"\">\",\"#\",IF(ISERROR(SEARCH(\"EUR\",$A6)),11,7)))+2,11))-1)/100,\"\")","v":0.66359999999999997},{"$f":"IFERROR(MID(VLOOKUP($C6,Tabelle2!$C:$D,2,FALSE),FIND(\"#\",SUBSTITUTE(VLOOKUP($C6,Tabelle2!$C:$D,2,FALSE),\"\"\">\",\"#\",IF(ISERROR(SEARCH(\"EUR\",$A6)),14,9)))+2,FIND(\"%\",MID(VLOOKUP($C6,Tabelle2!$C:$D,2,FALSE),FIND(\"#\",SUBSTITUTE(VLOOKUP($C6,Tabelle2!$C:$D,2,FALSE),\"\"\">\",\"#\",IF(ISERROR(SEARCH(\"EUR\",$A6)),14,9)))+2,11))-1)/100,\"\")","v":""}]
["Amundi MSCI World UCITS ETF - EUR (C)","A2H59Q","LU1681043599",{"$f":"IFERROR(MID(VLOOKUP($C7,Tabelle2!$C:$D,2,FALSE),FIND(\"#\",SUBSTITUTE(VLOOKUP($C7,Tabelle2!$C:$D,2,FALSE),\"\"\">\",\"#\",IF(ISERROR(SEARCH(\"EUR\",$A7)),2,1)))+2,FIND(\"%\",MID(VLOOKUP($C7,Tabelle2!$C:$D,2,FALSE),FIND(\"#\",SUBSTITUTE(VLOOKUP($C7,Tabelle2!$C:$D,2,FALSE),\"\"\">\",\"#\",IF(ISERROR(SEARCH(\"EUR\",$A7)),2,1)))+2,10))-1)/100,\"\")","v":9.9499999999999991E-2},{"$f":"IFERROR(MID(VLOOKUP($C7,Tabelle2!$C:$D,2,FALSE),FIND(\"#\",SUBSTITUTE(VLOOKUP($C7,Tabelle2!$C:$D,2,FALSE),\"\"\">\",\"#\",IF(ISERROR(SEARCH(\"EUR\",$A7)),5,3)))+2,FIND(\"%\",MID(VLOOKUP($C7,Tabelle2!$C:$D,2,FALSE),FIND(\"#\",SUBSTITUTE(VLOOKUP($C7,Tabelle2!$C:$D,2,FALSE),\"\"\">\",\"#\",IF(ISERROR(SEARCH(\"EUR\",$A7)),5,3)))+2,10))-1)/100,\"\")","v":""},{"$f":"IFERROR(MID(VLOOKUP($C7,Tabelle2!$C:$D,2,FALSE),FIND(\"#\",SUBSTITUTE(VLOOKUP($C7,Tabelle2!$C:$D,2,FALSE),\"\"\">\",\"#\",IF(ISERROR(SEARCH(\"EUR\",$A7)),8,5)))+2,FIND(\"%\",MID(VLOOKUP($C7,Tabelle2!$C:$D,2,FALSE),FIND(\"#\",SUBSTITUTE(VLOOKUP($C7,Tabelle2!$C:$D,2,FALSE),\"\"\">\",\"#\",IF(ISERROR(SEARCH(\"EUR\",$A7)),8,5)))+2,10))-1)/100,\"\")","v":""},{"$f":"IFERROR(MID(VLOOKUP($C7,Tabelle2!$C:$D,2,FALSE),FIND(\"#\",SUBSTITUTE(VLOOKUP($C7,Tabelle2!$C:$D,2,FALSE),\"\"\">\",\"#\",IF(ISERROR(SEARCH(\"EUR\",$A7)),11,7)))+2,FIND(\"%\",MID(VLOOKUP($C7,Tabelle2!$C:$D,2,FALSE),FIND(\"#\",SUBSTITUTE(VLOOKUP($C7,Tabelle2!$C:$D,2,FALSE),\"\"\">\",\"#\",IF(ISERROR(SEARCH(\"EUR\",$A7)),11,7)))+2,11))-1)/100,\"\")","v":""},{"$f":"IFERROR(MID(VLOOKUP($C7,Tabelle2!$C:$D,2,FALSE),FIND(\"#\",SUBSTITUTE(VLOOKUP($C7,Tabelle2!$C:$D,2,FALSE),\"\"\">\",\"#\",IF(ISERROR(SEARCH(\"EUR\",$A7)),14,9)))+2,FIND(\"%\",MID(VLOOKUP($C7,Tabelle2!$C:$D,2,FALSE),FIND(\"#\",SUBSTITUTE(VLOOKUP($C7,Tabelle2!$C:$D,2,FALSE),\"\"\">\",\"#\",IF(ISERROR(SEARCH(\"EUR\",$A7)),14,9)))+2,11))-1)/100,\"\")","v":""}]
["Xtrackers MSCI World Index UCITS ETF 1D","A1XEY2","IE00BK1PV551",{"$f":"IFERROR(MID(VLOOKUP($C8,Tabelle2!$C:$D,2,FALSE),FIND(\"#\",SUBSTITUTE(VLOOKUP($C8,Tabelle2!$C:$D,2,FALSE),\"\"\">\",\"#\",IF(ISERROR(SEARCH(\"EUR\",$A8)),2,1)))+2,FIND(\"%\",MID(VLOOKUP($C8,Tabelle2!$C:$D,2,FALSE),FIND(\"#\",SUBSTITUTE(VLOOKUP($C8,Tabelle2!$C:$D,2,FALSE),\"\"\">\",\"#\",IF(ISERROR(SEARCH(\"EUR\",$A8)),2,1)))+2,10))-1)/100,\"\")","v":0.1133},{"$f":"IFERROR(MID(VLOOKUP($C8,Tabelle2!$C:$D,2,FALSE),FIND(\"#\",SUBSTITUTE(VLOOKUP($C8,Tabelle2!$C:$D,2,FALSE),\"\"\">\",\"#\",IF(ISERROR(SEARCH(\"EUR\",$A8)),5,3)))+2,FIND(\"%\",MID(VLOOKUP($C8,Tabelle2!$C:$D,2,FALSE),FIND(\"#\",SUBSTITUTE(VLOOKUP($C8,Tabelle2!$C:$D,2,FALSE),\"\"\">\",\"#\",IF(ISERROR(SEARCH(\"EUR\",$A8)),5,3)))+2,10))-1)/100,\"\")","v":9.820000000000001E-2},{"$f":"IFERROR(MID(VLOOKUP($C8,Tabelle2!$C:$D,2,FALSE),FIND(\"#\",SUBSTITUTE(VLOOKUP($C8,Tabelle2!$C:$D,2,FALSE),\"\"\">\",\"#\",IF(ISERROR(SEARCH(\"EUR\",$A8)),8,5)))+2,FIND(\"%\",MID(VLOOKUP($C8,Tabelle2!$C:$D,2,FALSE),FIND(\"#\",SUBSTITUTE(VLOOKUP($C8,Tabelle2!$C:$D,2,FALSE),\"\"\">\",\"#\",IF(ISERROR(SEARCH(\"EUR\",$A8)),8,5)))+2,10))-1)/100,\"\")","v":0.46299999999999997},{"$f":"IFERROR(MID(VLOOKUP($C8,Tabelle2!$C:$D,2,FALSE),FIND(\"#\",SUBSTITUTE(VLOOKUP($C8,Tabelle2!$C:$D,2,FALSE),\"\"\">\",\"#\",IF(ISERROR(SEARCH(\"EUR\",$A8)),11,7)))+2,FIND(\"%\",MID(VLOOKUP($C8,Tabelle2!$C:$D,2,FALSE),FIND(\"#\",SUBSTITUTE(VLOOKUP($C8,Tabelle2!$C:$D,2,FALSE),\"\"\">\",\"#\",IF(ISERROR(SEARCH(\"EUR\",$A8)),11,7)))+2,11))-1)/100,\"\")","v":""},{"$f":"IFERROR(MID(VLOOKUP($C8,Tabelle2!$C:$D,2,FALSE),FIND(\"#\",SUBSTITUTE(VLOOKUP($C8,Tabelle2!$C:$D,2,FALSE),\"\"\">\",\"#\",IF(ISERROR(SEARCH(\"EUR\",$A8)),14,9)))+2,FIND(\"%\",MID(VLOOKUP($C8,Tabelle2!$C:$D,2,FALSE),FIND(\"#\",SUBSTITUTE(VLOOKUP($C8,Tabelle2!$C:$D,2,FALSE),\"\"\">\",\"#\",IF(ISERROR(SEARCH(\"EUR\",$A8)),14,9)))+2,11))-1)/100,\"\")","v":""}]
{"$rows_left_out":8}
{"sheet":"Tabelle2","index":1,"n_rows":15,"n_cols":4,"rows_kept":15,"cut":false,"hidden":false,"merged":[]}
[]
["ING Fonds","WKN","ISIN","Spalte1"]
["iShares Core MSCI World UCITS ETF USD (Acc)","A0RPWH","IE00B4L5Y983",{"$f":"fwPerfString(C3)","v":"\n<tr><td>laufendes&nbsp;Jahr</td><td><span class=\"fw--table-cell_green\">+9,13%</span></td><td><span class=\"fw--table-cell_green\">+10,53%</span></td><td><span class=\"fw--table-cell_green\">+9,75%</span></td></tr><tr><td>1&nbsp;Jahr</td><td><span class=\"fw--table-cell_green\">+0,66%</span></td><td><span class=\"fw--table-cell_green\">+9,82%</span></td><td><span class=\"fw--table-cell_green\">+4,68%</span></td></tr><tr><td>3&nbsp;Jahre</td><td><span class=\"fw--table-cell_green\">+46,71%</span></td><td><span class=\"fw--table-cell_green\">+46,32%</span></td><td><span class=\"fw--table-cell_green\">+35,17%</span></td></tr><tr><td>5&nbsp;Jahre</td><td><span class=\"fw--table-cell_green\">+38,38%</span></td><td><span class=\"fw--table-cell_green\">+67,39%</span></td><td><span class=\"fw--table-cell_green\">+45,35%</span></td></tr> </tbody>\n</table>\n</div>\n</div>\n<div class=\"col-12 col-lg\">\n<h3 class=\"fw--h2 text-color_lightblue01\">Annualisiert</h3>\n<div class=\"fw--table-wrapper f-table-overflow\">\n<table class=\"fw--table fw--table_responsive js-fw--table_responsive table-performances\">\n<thead>\n<tr>\n<th></th>\n<th>Fonds <span class=\"currency\" style=\"background-color: #c8a4d4;\">USD</span></th>\n<th>Fonds <span class=\"currency\">EUR</span></th>\n<th>Sektor <span class=\"currency\">EUR</span></th>\n</tr>\n</thead>\n"}]
["ComStage MSCI World TRN UCITS ETF","ETF110","LU0392494562","\n<tr><td>laufendes&nbsp;Jahr</td><td><span class=\"fw--table-cell_green\">+9,91%</span></td><td><span class=\"fw--table-cell_green\">+11,35%</span></td><td><span class=\"fw--table-cell_green\">+9,75%</span></td></tr><tr><td>1&nbsp;Jahr</td><td><span class=\"fw--table-cell_green\">+0,75%</span></td><td><span class=\"fw--table-cell_green\">+9,91%</span></td><td><span class=\"fw--table-cell_green\">+4,68%</span></td></tr><tr><td>3&nbsp;Jahre</td><td><span class=\"fw--table-cell_green\">+46,59%</span></td><td><span class=\"fw--table-cell_green\">+46,20%</span></td><td><span class=\"fw--table-cell_green\">+35,17%</span></td></tr><tr><td>5&nbsp;Jahre</td><td><span class=\"fw--table-cell_green\">+37,78%</span></td><td><span class=\"fw--table-cell_green\">+66,66%</span></td><td><span class=\"fw--table-cell_green\">+45,35%</span></td></tr><tr><td>10&nbsp;Jahre</td><td><span class=\"fw--table-cell_green\">+201,14%</span></td><td><span class=\"fw--table-cell_green\">+241,57%</span></td><td><span class=\"fw--table-cell_green\">+165,02%</span></td></tr> </tbody>\n</table>\n</div>\n</div>\n<div class=\"col-12 col-lg\">\n<h3 class=\"fw--h2 text-color_lightblue01\">Annualisiert</h3>\n<div class=\"fw--table-wrapper f-table-overflow\">\n<table class=\"fw--table fw--table_responsive js-fw--table_responsive table-performances\">\n<thead>\n<tr>\n<th></th>\n<th>Fonds <span class=\"currency\" style=\"background-color: #c8a4d4;\">USD</span></th>\n<th>Fonds <span class=\"currency\">EUR</span></th>\n<th>Sektor <span class=\"currency\">EUR</span></th>\n</tr>\n</thead>\n"]
["Lyxor MSCI World UCITS ETF D-EUR","LYX0AG","FR0010315770","\n<tr><td>laufendes&nbsp;Jahr</td><td><span class=\"fw--table-cell_green\">+10,51%</span></td><td><span class=\"fw--table-cell_green\">+9,75%</span></td></tr><tr><td>1&nbsp;Jahr</td><td><span class=\"fw--table-cell_green\">+10,13%</span></td><td><span class=\"fw--table-cell_green\">+4,68%</span></td></tr><tr><td>3&nbsp;Jahre</td><td><span class=\"fw--table-cell_green\">+45,92%</span></td><td><span class=\"fw--table-cell_green\">+35,17%</span></td></tr><tr><td>5&nbsp;Jahre</td><td><span class=\"fw--table-cell_green\">+66,74%</span></td><td><span class=\"fw--table-cell_green\">+45,35%</span></td></tr><tr><td>10&nbsp;Jahre</td><td><span class=\"fw--table-cell_green\">+235,15%</span></td><td><span class=\"fw--table-cell_green\">+165,02%</span></td></tr> </tbody>\n</table>\n</div>\n</div>\n<div class=\"col-12 col-lg\">\n<h3 class=\"fw--h2 text-color_lightblue01\">Annualisiert</h3>\n<div class=\"fw--table-wrapper f-table-overflow\">\n<table class=\"fw--table fw--table_responsive js-fw--table_responsive table-performances\">\n<thead>\n<tr>\n<th></th>\n<th>Fonds in EUR</th>\n<th>Sektor in EUR</th>\n</tr>\n</thead>\n"]
["HSBC MSCI WORLD UCITS ETF","A1C9KL","DE000A1C9KL8","\n<tr><td>laufendes&nbsp;Jahr</td><td><span class=\"fw--table-cell_green\">+9,13%</span></td><td><span class=\"fw--table-cell_green\">+10,53%</span></td><td><span class=\"fw--table-cell_green\">+9,75%</span></td></tr><tr><td>1&nbsp;Jahr</td><td><span class=\"fw--table-cell_green\">+1,03%</span></td><td><span class=\"fw--table-cell_green\">+10,22%</span></td><td><span class=\"fw--table-cell_green\">+4,68%</span></td></tr><tr><td>3&nbsp;Jahre</td><td><span class=\"fw--table-cell_green\">+47,59%</span></td><td><span class=\"fw--table-cell_green\">+47,20%</span></td><td><span class=\"fw--table-cell_green\">+35,17%</span></td></tr><tr><td>5&nbsp;Jahre</td><td><span class=\"fw--table-cell_green\">+37,53%</span></td><td><span class=\"fw--table-cell_green\">+66,36%</span></td><td><span class=\"fw--table-cell_green\">+45,35%</span></td></tr> </tbody>\n</table>\n</div>\n</div>\n<div class=\"col-12 col-lg\">\n<h3 class=\"fw--h2 text-color_lightblue01\">Annualisiert</h3>\n<div class=\"fw--table-wrapper f-table-overflow\">\n<table class=\"fw--table fw--table_responsive js-fw--table_responsive table-performances\">\n<thead>\n<tr>\n<th></th>\n<th>Fonds <span class=\"currency\" style=\"background-color: #c8a4d4;\">USD</span></th>\n<th>Fonds <span class=\"currency\">EUR</span></th>\n<th>Sektor <span class=\"currency\">EUR</span></th>\n</tr>\n</thead>\n"]
["Amundi MSCI World UCITS ETF - EUR (C)","A2H59Q","LU1681043599","\n<tr><td>laufendes&nbsp;Jahr</td><td><span class=\"fw--table-cell_green\">+9,95%</span></td><td><span class=\"fw--table-cell_green\">+9,75%</span></td></tr> </tbody>\n</table>\n</div>\n</div>\n<div class=\"col-12 col-lg\">\n<h3 class=\"fw--h2 text-color_lightblue01\">Annualisiert</h3>\n<div class=\"fw--table-wrapper f-table-overflow\">\n<table class=\"fw--table fw--table_responsive js-fw--table_responsive table-performances\">\n<thead>\n<tr>\n<th></th>\n<th>Fonds in EUR</th>\n<th>Sektor in EUR</th>\n</tr>\n</thead>\n"]
["Xtrackers MSCI World Index UCITS ETF 1D","A1XEY2","IE00BK1PV551","\n<tr><td>laufendes&nbsp;Jahr</td><td><span class=\"fw--table-cell_green\">+9,88%</span></td><td><span class=\"fw--table-cell_green\">+11,33%</span></td><td><span class=\"fw--table-cell_green\">+9,75%</span></td></tr><tr><td>1&nbsp;Jahr</td><td><span class=\"fw--table-cell_green\">+0,67%</span></td><td><span class=\"fw--table-cell_green\">+9,82%</span></td><td><span class=\"fw--table-cell_green\">+4,68%</span></td></tr><tr><td>3&nbsp;Jahre</td><td><span class=\"fw--table-cell_green\">+46,69%</span></td><td><span class=\"fw--table-cell_green\">+46,30%</span></td><td><span class=\"fw--table-cell_green\">+35,17%</span></td></tr> </tbody>\n</table>\n</div>\n</div>\n<div class=\"col-12 col-lg\">\n<h3 class=\"fw--h2 text-color_lightblue01\">Annualisiert</h3>\n<div class=\"fw--table-wrapper f-table-overflow\">\n<table class=\"fw--table fw--table_responsive js-fw--table_responsive table-performances\">\n<thead>\n<tr>\n<th></th>\n<th>Fonds <span class=\"currency\" style=\"background-color: #c8a4d4;\">USD</span></th>\n<th>Fonds <span class=\"currency\">EUR</span></th>\n<th>Sektor <span class=\"currency\">EUR</span></th>\n</tr>\n</thead>\n"]
{"$rows_left_out":7}