{"text_format":"1","workbook":"xlsx","n_sheets":2,"sheets":["Tabelle1","Tabelle2"],"not_rendered":{"charts":0,"images":2,"macros":1,"external_links":0,"defined_names":0,"comments":0,"pivot_tables":0},"unopened":[],"bounds":{"document_bytes":16777216,"sheet_cells":100000,"rows_first":2000,"rows_last":500,"rows_between":2000,"halvings":0,"cell_chars":16384,"cell_head_chars":4096},"cells_cut":0,"cells_raw":0,"read":"whole","date_system":"1900"}

{"sheet":"Tabelle1","index":0,"n_rows":12,"n_cols":8,"rows_kept":12,"cut":false,"hidden":false,"merged":[]}
[]
["Name","WKN","ISIN","1M","3M","6M","1J","3J"]
["iShares Core MSCI World UCITS ETF USD (Acc)","A0RPWH","IE00B4L5Y983",{"$f":"IFERROR(MID(VLOOKUP($C3,Tabelle2!$C:$D,2,FALSE),FIND(\"#\",SUBSTITUTE(VLOOKUP($C3,Tabelle2!$C:$D,2,FALSE),\"\"\">\",\"#\",1))+2,FIND(\"%\",MID(VLOOKUP($C3,Tabelle2!$C:$D,2,FALSE),FIND(\"#\",SUBSTITUTE(VLOOKUP($C3,Tabelle2!$C:$D,2,FALSE),\"\"\">\",\"#\",1))+2,10))-1)/100,\"\")","v":6.88E-2},{"$f":"IFERROR(MID(VLOOKUP($C3,Tabelle2!$C:$D,2,FALSE),FIND(\"#\",SUBSTITUTE(VLOOKUP($C3,Tabelle2!$C:$D,2,FALSE),\"\"\">\",\"#\",2))+2,FIND(\"%\",MID(VLOOKUP($C3,Tabelle2!$C:$D,2,FALSE),FIND(\"#\",SUBSTITUTE(VLOOKUP($C3,Tabelle2!$C:$D,2,FALSE),\"\"\">\",\"#\",2))+2,10))-1)/100,\"\")","v":2.0499999999999997E-2},{"$f":"IFERROR(MID(VLOOKUP($C3,Tabelle2!$C:$D,2,FALSE),FIND(\"#\",SUBSTITUTE(VLOOKUP($C3,Tabelle2!$C:$D,2,FALSE),\"\"\">\",\"#\",3))+2,FIND(\"%\",MID(VLOOKUP($C3,Tabelle2!$C:$D,2,FALSE),FIND(\"#\",SUBSTITUTE(VLOOKUP($C3,Tabelle2!$C:$D,2,FALSE),\"\"\">\",\"#\",3))+2,10))-1)/100,\"\")","v":-2.3900000000000001E-2},{"$f":"IFERROR(MID(VLOOKUP($C3,Tabelle2!$C:$D,2,FALSE),FIND(\"#\",SUBSTITUTE(VLOOKUP($C3,Tabelle2!$C:$D,2,FALSE),\"\"\">\",\"#\",4))+2,FIND(\"%\",MID(VLOOKUP($C3,Tabelle2!$C:$D,2,FALSE),FIND(\"#\",SUBSTITUTE(VLOOKUP($C3,Tabelle2!$C:$D,2,FALSE),\"\"\">\",\"#\",4))+2,10))-1)/100,\"\")","v":8.5099999999999995E-2},{"$f":"IFERROR(MID(VLOOKUP($C3,Tabelle2!$C:$D,2,FALSE),FIND(\"#\",SUBSTITUTE(VLOOKUP($C3,Tabelle2!$C:$D,2,FALSE),\"\"\">\",\"#\",5))+2,FIND(\"%\",MID(VLOOKUP($C3,Tabelle2!$C:$D,2,FALSE),FIND(\"#\",SUBSTITUTE(VLOOKUP($C3,Tabelle2!$C:$D,2,FALSE),\"\"\">\",\"#\",5))+2,10))-1)/100,\"\")","v":0.46200000000000002}]
["ComStage MSCI World TRN UCITS ETF","ETF110","LU0392494562",{"$f":"IFERROR(MID(VLOOKUP($C4,Tabelle2!$C:$D,2,FALSE),FIND(\"#\",SUBSTITUTE(VLOOKUP($C4,Tabelle2!$C:$D,2,FALSE),\"\"\">\",\"#\",1))+2,FIND(\"%\",MID(VLOOKUP($C4,Tabelle2!$C:$D,2,FALSE),FIND(\"#\",SUBSTITUTE(VLOOKUP($C4,Tabelle2!$C:$D,2,FALSE),\"\"\">\",\"#\",1))+2,10))-1)/100,\"\")","v":7.1199999999999999E-2},{"$f":"IFERROR(MID(VLOOKUP($C4,Tabelle2!$C:$D,2,FALSE),FIND(\"#\",SUBSTITUTE(VLOOKUP($C4,Tabelle2!$C:$D,2,FALSE),\"\"\">\",\"#\",2))+2,FIND(\"%\",MID(VLOOKUP($C4,Tabelle2!$C:$D,2,FALSE),FIND(\"#\",SUBSTITUTE(VLOOKUP($C4,Tabelle2!$C:$D,2,FALSE),\"\"\">\",\"#\",2))+2,10))-1)/100,\"\")","v":2.0899999999999998E-2},{"$f":"IFERROR(MID(VLOOKUP($C4,Tabelle2!$C:$D,2,FALSE),FIND(\"#\",SUBSTITUTE(VLOOKUP($C4,Tabelle2!$C:$D,2,FALSE),\"\"\">\",\"#\",3))+2,FIND(\"%\",MID(VLOOKUP($C4,Tabelle2!$C:$D,2,FALSE),FIND(\"#\",SUBSTITUTE(VLOOKUP($C4,Tabelle2!$C:$D,2,FALSE),\"\"\">\",\"#\",3))+2,10))-1)/100,\"\")","v":-2.3599999999999999E-2},{"$f":"IFERROR(MID(VLOOKUP($C4,Tabelle2!$C:$D,2,FALSE),FIND(\"#\",SUBSTITUTE(VLOOKUP($C4,Tabelle2!$C:$D,2,FALSE),\"\"\">\",\"#\",4))+2,FIND(\"%\",MID(VLOOKUP($C4,Tabelle2!$C:$D,2,FALSE),FIND(\"#\",SUBSTITUTE(VLOOKUP($C4,Tabelle2!$C:$D,2,FALSE),\"\"\">\",\"#\",4))+2,10))-1)/100,\"\")","v":8.6199999999999999E-2},{"$f":"IFERROR(MID(VLOOKUP($C4,Tabelle2!$C:$D,2,FALSE),FIND(\"#\",SUBSTITUTE(VLOOKUP($C4,Tabelle2!$C:$D,2,FALSE),\"\"\">\",\"#\",5))+2,FIND(\"%\",MID(VLOOKUP($C4,Tabelle2!$C:$D,2,FALSE),FIND(\"#\",SUBSTITUTE(VLOOKUP($C4,Tabelle2!$C:$D,2,FALSE),\"\"\">\",\"#\",5))+2,10))-1)/100,\"\")","v":0.46079999999999999}]
["Lyxor MSCI World UCITS ETF D-EUR","LYX0AG","FR0010315770",{"$f":"IFERROR(MID(VLOOKUP($C5,Tabelle2!$C:$D,2,FALSE),FIND(\"#\",SUBSTITUTE(VLOOKUP($C5,Tabelle2!$C:$D,2,FALSE),\"\"\">\",\"#\",1))+2,FIND(\"%\",MID(VLOOKUP($C5,Tabelle2!$C:$D,2,FALSE),FIND(\"#\",SUBSTITUTE(VLOOKUP($C5,Tabelle2!$C:$D,2,FALSE),\"\"\">\",\"#\",1))+2,10))-1)/100,\"\")","v":6.8699999999999997E-2},{"$f":"IFERROR(MID(VLOOKUP($C5,Tabelle2!$C:$D,2,FALSE),FIND(\"#\",SUBSTITUTE(VLOOKUP($C5,Tabelle2!$C:$D,2,FALSE),\"\"\">\",\"#\",2))+2,FIND(\"%\",MID(VLOOKUP($C5,Tabelle2!$C:$D,2,FALSE),FIND(\"#\",SUBSTITUTE(VLOOKUP($C5,Tabelle2!$C:$D,2,FALSE),\"\"\">\",\"#\",2))+2,10))-1)/100,\"\")","v":2.1299999999999999E-2},{"$f":"IFERROR(MID(VLOOKUP($C5,Tabelle2!$C:$D,2,FALSE),FIND(\"#\",SUBSTITUTE(VLOOKUP($C5,Tabelle2!$C:$D,2,FALSE),\"\"\">\",\"#\",3))+2,FIND(\"%\",MID(VLOOKUP($C5,Tabelle2!$C:$D,2,FALSE),FIND(\"#\",SUBSTITUTE(VLOOKUP($C5,Tabelle2!$C:$D,2,FALSE),\"\"\">\",\"#\",3))+2,10))-1)/100,\"\")","v":-2.7300000000000001E-2},{"$f":"IFERROR(MID(VLOOKUP($C5,Tabelle2!$C:$D,2,FALSE),FIND(\"#\",SUBSTITUTE(VLOOKUP($C5,Tabelle2!$C:$D,2,FALSE),\"\"\">\",\"#\",4))+2,FIND(\"%\",MID(VLOOKUP($C5,Tabelle2!$C:$D,2,FALSE),FIND(\"#\",SUBSTITUTE(VLOOKUP($C5,Tabelle2!$C:$D,2,FALSE),\"\"\">\",\"#\",4))+2,10))-1)/100,\"\")","v":8.9399999999999993E-2},{"$f":"IFERROR(MID(VLOOKUP($C5,Tabelle2!$C:$D,2,FALSE),FIND(\"#\",SUBSTITUTE(VLOOKUP($C5,Tabelle2!$C:$D,2,FALSE),\"\"\">\",\"#\",5))+2,FIND(\"%\",MID(VLOOKUP($C5,Tabelle2!$C:$D,2,FALSE),FIND(\"#\",SUBSTITUTE(VLOOKUP($C5,Tabelle2!$C:$D,2,FALSE),\"\"\">\",\"#\",5))+2,10))-1)/100,\"\")","v":0.45530000000000004}]
["HSBC MSCI WORLD UCITS ETF","A1C9KL","DE000A1C9KL8",{"$f":"IFERROR(MID(VLOOKUP($C6,Tabelle2!$C:$D,2,FALSE),FIND(\"#\",SUBSTITUTE(VLOOKUP($C6,Tabelle2!$C:$D,2,FALSE),\"\"\">\",\"#\",1))+2,FIND(\"%\",MID(VLOOKUP($C6,Tabelle2!$C:$D,2,FALSE),FIND(\"#\",SUBSTITUTE(VLOOKUP($C6,Tabelle2!$C:$D,2,FALSE),\"\"\">\",\"#\",1))+2,10))-1)/100,\"\")","v":6.9199999999999998E-2},{"$f":"IFERROR(MID(VLOOKUP($C6,Tabelle2!$C:$D,2,FALSE),FIND(\"#\",SUBSTITUTE(VLOOKUP($C6,Tabelle2!$C:$D,2,FALSE),\"\"\">\",\"#\",2))+2,FIND(\"%\",MID(VLOOKUP($C6,Tabelle2!$C:$D,2,FALSE),FIND(\"#\",SUBSTITUTE(VLOOKUP($C6,Tabelle2!$C:$D,2,FALSE),\"\"\">\",\"#\",2))+2,10))-1)/100,\"\")","v":2.1600000000000001E-2},{"$f":"IFERROR(MID(VLOOKUP($C6,Tabelle2!$C:$D,2,FALSE),FIND(\"#\",SUBSTITUTE(VLOOKUP($C6,Tabelle2!$C:$D,2,FALSE),\"\"\">\",\"#\",3))+2,FIND(\"%\",MID(VLOOKUP($C6,Tabelle2!$C:$D,2,FALSE),FIND(\"#\",SUBSTITUTE(VLOOKUP($C6,Tabelle2!$C:$D,2,FALSE),\"\"\">\",\"#\",3))+2,10))-1)/100,\"\")","v":-2.2099999999999998E-2},{"$f":"IFERROR(MID(VLOOKUP($C6,Tabelle2!$C:$D,2,FALSE),FIND(\"#\",SUBSTITUTE(VLOOKUP($C6,Tabelle2!$C:$D,2,FALSE),\"\"\">\",\"#\",4))+2,FIND(\"%\",MID(VLOOKUP($C6,Tabelle2!$C:$D,2,FALSE),FIND(\"#\",SUBSTITUTE(VLOOKUP($C6,Tabelle2!$C:$D,2,FALSE),\"\"\">\",\"#\",4))+2,10))-1)/100,\"\")","v":8.9399999999999993E-2},{"$f":"IFERROR(MID(VLOOKUP($C6,Tabelle2!$C:$D,2,FALSE),FIND(\"#\",SUBSTITUTE(VLOOKUP($C6,Tabelle2!$C:$D,2,FALSE),\"\"\">\",\"#\",5))+2,FIND(\"%\",MID(VLOOKUP($C6,Tabelle2!$C:$D,2,FALSE),FIND(\"#\",SUBSTITUTE(VLOOKUP($C6,Tabelle2!$C:$D,2,FALSE),\"\"\">\",\"#\",5))+2,10))-1)/100,\"\")","v":0.47090000000000004}]
["Amundi MSCI World UCITS ETF - EUR (C)","A2H59Q","LU1681043599",{"$f":"IFERROR(MID(VLOOKUP($C7,Tabelle2!$C:$D,2,FALSE),FIND(\"#\",SUBSTITUTE(VLOOKUP($C7,Tabelle2!$C:$D,2,FALSE),\"\"\">\",\"#\",1))+2,FIND(\"%\",MID(VLOOKUP($C7,Tabelle2!$C:$D,2,FALSE),FIND(\"#\",SUBSTITUTE(VLOOKUP($C7,Tabelle2!$C:$D,2,FALSE),\"\"\">\",\"#\",1))+2,10))-1)/100,\"\")","v":6.8499999999999991E-2},{"$f":"IFERROR(MID(VLOOKUP($C7,Tabelle2!$C:$D,2,FALSE),FIND(\"#\",SUBSTITUTE(VLOOKUP($C7,Tabelle2!$C:$D,2,FALSE),\"\"\">\",\"#\",2))+2,FIND(\"%\",MID(VLOOKUP($C7,Tabelle2!$C:$D,2,FALSE),FIND(\"#\",SUBSTITUTE(VLOOKUP($C7,Tabelle2!$C:$D,2,FALSE),\"\"\">\",\"#\",2))+2,10))-1)/100,\"\")","v":2.1099999999999997E-2},{"$f":"IFERROR(MID(VLOOKUP($C7,Tabelle2!$C:$D,2,FALSE),FIND(\"#\",SUBSTITUTE(VLOOKUP($C7,Tabelle2!$C:$D,2,FALSE),\"\"\">\",\"#\",3))+2,FIND(\"%\",MID(VLOOKUP($C7,Tabelle2!$C:$D,2,FALSE),FIND(\"#\",SUBSTITUTE(VLOOKUP($C7,Tabelle2!$C:$D,2,FALSE),\"\"\">\",\"#\",3))+2,10))-1)/100,\"\")","v":-2.7799999999999998E-2},{"$f":"IFERROR(MID(VLOOKUP($C7,Tabelle2!$C:$D,2,FALSE),FIND(\"#\",SUBSTITUTE(VLOOKUP($C7,Tabelle2!$C:$D,2,FALSE),\"\"\">\",\"#\",4))+2,FIND(\"%\",MID(VLOOKUP($C7,Tabelle2!$C:$D,2,FALSE),FIND(\"#\",SUBSTITUTE(VLOOKUP($C7,Tabelle2!$C:$D,2,FALSE),\"\"\">\",\"#\",4))+2,10))-1)/100,\"\")","v":8.8399999999999992E-2},{"$f":"IFERROR(MID(VLOOKUP($C7,Tabelle2!$C:$D,2,FALSE),FIND(\"#\",SUBSTITUTE(VLOOKUP($C7,Tabelle2!$C:$D,2,FALSE),\"\"\">\",\"#\",5))+2,FIND(\"%\",MID(VLOOKUP($C7,Tabelle2!$C:$D,2,FALSE),FIND(\"#\",SUBSTITUTE(VLOOKUP($C7,Tabelle2!$C:$D,2,FALSE),\"\"\">\",\"#\",5))+2,10))-1)/100,\"\")","v":0.45069999999999999}]
["Xtrackers MSCI World Index UCITS ETF 1D","A1XEY2","IE00BK1PV551",{"$f":"IFERROR(MID(VLOOKUP($C8,Tabelle2!$C:$D,2,FALSE),FIND(\"#\",SUBSTITUTE(VLOOKUP($C8,Tabelle2!$C:$D,2,FALSE),\"\"\">\",\"#\",1))+2,FIND(\"%\",MID(VLOOKUP($C8,Tabelle2!$C:$D,2,FALSE),FIND(\"#\",SUBSTITUTE(VLOOKUP($C8,Tabelle2!$C:$D,2,FALSE),\"\"\">\",\"#\",1))+2,10))-1)/100,\"\")","v":6.8600000000000008E-2},{"$f":"IFERROR(MID(VLOOKUP($C8,Tabelle2!$C:$D,2,FALSE),FIND(\"#\",SUBSTITUTE(VLOOKUP($C8,Tabelle2!$C:$D,2,FALSE),\"\"\">\",\"#\",2))+2,FIND(\"%\",MID(VLOOKUP($C8,Tabelle2!$C:$D,2,FALSE),FIND(\"#\",SUBSTITUTE(VLOOKUP($C8,Tabelle2!$C:$D,2,FALSE),\"\"\">\",\"#\",2))+2,10))-1)/100,\"\")","v":2.0400000000000001E-2},{"$f":"IFERROR(MID(VLOOKUP($C8,Tabelle2!$C:$D,2,FALSE),FIND(\"#\",SUBSTITUTE(VLOOKUP($C8,Tabelle2!$C:$D,2,FALSE),\"\"\">\",\"#\",3))+2,FIND(\"%\",MID(VLOOKUP($C8,Tabelle2!$C:$D,2,FALSE),FIND(\"#\",SUBSTITUTE(VLOOKUP($C8,Tabelle2!$C:$D,2,FALSE),\"\"\">\",\"#\",3))+2,10))-1)/100,\"\")","v":-2.4199999999999999E-2},{"$f":"IFERROR(MID(VLOOKUP($C8,Tabelle2!$C:$D,2,FALSE),FIND(\"#\",SUBSTITUTE(VLOOKUP($C8,Tabelle2!$C:$D,2,FALSE),\"\"\">\",\"#\",4))+2,FIND(\"%\",MID(VLOOKUP($C8,Tabelle2!$C:$D,2,FALSE),FIND(\"#\",SUBSTITUTE(VLOOKUP($C8,Tabelle2!$C:$D,2,FALSE),\"\"\">\",\"#\",4))+2,10))-1)/100,\"\")","v":8.4900000000000003E-2},{"$f":"IFERROR(MID(VLOOKUP($C8,Tabelle2!$C:$D,2,FALSE),FIND(\"#\",SUBSTITUTE(VLOOKUP($C8,Tabelle2!$C:$D,2,FALSE),\"\"\">\",\"#\",5))+2,FIND(\"%\",MID(VLOOKUP($C8,Tabelle2!$C:$D,2,FALSE),FIND(\"#\",SUBSTITUTE(VLOOKUP($C8,Tabelle2!$C:$D,2,FALSE),\"\"\">\",\"#\",5))+2,10))-1)/100,\"\")","v":0.46140000000000003}]
["Xtrackers MSCI World Index UCITS ETF 1C","A1XB5U","IE00BJ0KDQ92",{"$f":"IFERROR(MID(VLOOKUP($C9,Tabelle2!$C:$D,2,FALSE),FIND(\"#\",SUBSTITUTE(VLOOKUP($C9,Tabelle2!$C:$D,2,FALSE),\"\"\">\",\"#\",1))+2,FIND(\"%\",MID(VLOOKUP($C9,Tabelle2!$C:$D,2,FALSE),FIND(\"#\",SUBSTITUTE(VLOOKUP($C9,Tabelle2!$C:$D,2,FALSE),\"\"\">\",\"#\",1))+2,10))-1)/100,\"\")","v":6.8600000000000008E-2},{"$f":"IFERROR(MID(VLOOKUP($C9,Tabelle2!$C:$D,2,FALSE),FIND(\"#\",SUBSTITUTE(VLOOKUP($C9,Tabelle2!$C:$D,2,FALSE),\"\"\">\",\"#\",2))+2,FIND(\"%\",MID(VLOOKUP($C9,Tabelle2!$C:$D,2,FALSE),FIND(\"#\",SUBSTITUTE(VLOOKUP($C9,Tabelle2!$C:$D,2,FALSE),\"\"\">\",\"#\",2))+2,10))-1)/100,\"\")","v":2.0299999999999999E-2},{"$f":"IFERROR(MID(VLOOKUP($C9,Tabelle2!$C:$D,2,FALSE),FIND(\"#\",SUBSTITUTE(VLOOKUP($C9,Tabelle2!$C:$D,2,FALSE),\"\"\">\",\"#\",3))+2,FIND(\"%\",MID(VLOOKUP($C9,Tabelle2!$C:$D,2,FALSE),FIND(\"#\",SUBSTITUTE(VLOOKUP($C9,Tabelle2!$C:$D,2,FALSE),\"\"\">\",\"#\",3))+2,10))-1)/100,\"\")","v":-2.4300000000000002E-2},{"$f":"IFERROR(MID(VLOOKUP($C9,Tabelle2!$C:$D,2,FALSE),FIND(\"#\",SUBSTITUTE(VLOOKUP($C9,Tabelle2!$C:$D,2,FALSE),\"\"\">\",\"#\",4))+2,FIND(\"%\",MID(VLOOKUP($C9,Tabelle2!$C:$D,2,FALSE),FIND(\"#\",SUBSTITUTE(VLOOKUP($C9,Tabelle2!$C:$D,2,FALSE),\"\"\">\",\"#\",4))+2,10))-1)/100,\"\")","v":8.5099999999999995E-2},{"$f":"IFERROR(MID(VLOOKUP($C9,Tabelle2!$C:$D,2,FALSE),FIND(\"#\",SUBSTITUTE(VLOOKUP($C9,Tabelle2!$C:$D,2,FALSE),\"\"\">\",\"#\",5))+2,FIND(\"%\",MID(VLOOKUP($C9,Tabelle2!$C:$D,2,FALSE),FIND(\"#\",SUBSTITUTE(VLOOKUP($C9,Tabelle2!$C:$D,2,FALSE),\"\"\">\",\"#\",5))+2,10))-1)/100,\"\")","v":0.46179999999999999}]
["Invesco MSCI World UCITS ETF","A0RGCS","IE00B60SX394",{"$f":"IFERROR(MID(VLOOKUP($C10,Tabelle2!$C:$D,2,FALSE),FIND(\"#\",SUBSTITUTE(VLOOKUP($C10,Tabelle2!$C:$D,2,FALSE),\"\"\">\",\"#\",1))+2,FIND(\"%\",MID(VLOOKUP($C10,Tabelle2!$C:$D,2,FALSE),FIND(\"#\",SUBSTITUTE(VLOOKUP($C10,Tabelle2!$C:$D,2,FALSE),\"\"\">\",\"#\",1))+2,10))-1)/100,\"\")","v":6.8199999999999997E-2},{"$f":"IFERROR(MID(VLOOKUP($C10,Tabelle2!$C:$D,2,FALSE),FIND(\"#\",SUBSTITUTE(VLOOKUP($C10,Tabelle2!$C:$D,2,FALSE),\"\"\">\",\"#\",2))+2,FIND(\"%\",MID(VLOOKUP($C10,Tabelle2!$C:$D,2,FALSE),FIND(\"#\",SUBSTITUTE(VLOOKUP($C10,Tabelle2!$C:$D,2,FALSE),\"\"\">\",\"#\",2))+2,10))-1)/100,\"\")","v":0.02},{"$f":"IFERROR(MID(VLOOKUP($C10,Tabelle2!$C:$D,2,FALSE),FIND(\"#\",SUBSTITUTE(VLOOKUP($C10,Tabelle2!$C:$D,2,FALSE),\"\"\">\",\"#\",3))+2,FIND(\"%\",MID(VLOOKUP($C10,Tabelle2!$C:$D,2,FALSE),FIND(\"#\",SUBSTITUTE(VLOOKUP($C10,Tabelle2!$C:$D,2,FALSE),\"\"\">\",\"#\",3))+2,10))-1)/100,\"\")","v":-2.4300000000000002E-2},{"$f":"IFERROR(MID(VLOOKUP($C10,Tabelle2!$C:$D,2,FALSE),FIND(\"#\",SUBSTITUTE(VLOOKUP($C10,Tabelle2!$C:$D,2,FALSE),\"\"\">\",\"#\",4))+2,FIND(\"%\",MID(VLOOKUP($C10,Tabelle2!$C:$D,2,FALSE),FIND(\"#\",SUBSTITUTE(VLOOKUP($C10,Tabelle2!$C:$D,2,FALSE),\"\"\">\",\"#\",4))+2,10))-1)/100,\"\")","v":8.48E-2},{"$f":"IFERROR(MID(VLOOKUP($C10,Tabelle2!$C:$D,2,FALSE),FIND(\"#\",SUBSTITUTE(VLOOKUP($C10,Tabelle2!$C:$D,2,FALSE),\"\"\">\",\"#\",5))+2,FIND(\"%\",MID(VLOOKUP($C10,Tabelle2!$C:$D,2,FALSE),FIND(\"#\",SUBSTITUTE(VLOOKUP($C10,Tabelle2!$C:$D,2,FALSE),\"\"\">\",\"#\",5))+2,10))-1)/100,\"\")","v":0.4597}]
["UBS ETF (IE) MSCI World UCITS ETF (USD) A-dis","A1JVCA","IE00B7KQ7B66",{"$f":"IFERROR(MID(VLOOKUP($C11,Tabelle2!$C:$D,2,FALSE),FIND(\"#\",SUBSTITUTE(VLOOKUP($C11,Tabelle2!$C:$D,2,FALSE),\"\"\">\",\"#\",1))+2,FIND(\"%\",MID(VLOOKUP($C11,Tabelle2!$C:$D,2,FALSE),FIND(\"#\",SUBSTITUTE(VLOOKUP($C11,Tabelle2!$C:$D,2,FALSE),\"\"\">\",\"#\",1))+2,10))-1)/100,\"\")","v":6.8199999999999997E-2},{"$f":"IFERROR(MID(VLOOKUP($C11,Tabelle2!$C:$D,2,FALSE),FIND(\"#\",SUBSTITUTE(VLOOKUP($C11,Tabelle2!$C:$D,2,FALSE),\"\"\">\",\"#\",2))+2,FIND(\"%\",MID(VLOOKUP($C11,Tabelle2!$C:$D,2,FALSE),FIND(\"#\",SUBSTITUTE(VLOOKUP($C11,Tabelle2!$C:$D,2,FALSE),\"\"\">\",\"#\",2))+2,10))-1)/100,\"\")","v":1.9799999999999998E-2},{"$f":"IFERROR(MID(VLOOKUP($C11,Tabelle2!$C:$D,2,FALSE),FIND(\"#\",SUBSTITUTE(VLOOKUP($C11,Tabelle2!$C:$D,2,FALSE),\"\"\">\",\"#\",3))+2,FIND(\"%\",MID(VLOOKUP($C11,Tabelle2!$C:$D,2,FALSE),FIND(\"#\",SUBSTITUTE(VLOOKUP($C11,Tabelle2!$C:$D,2,FALSE),\"\"\">\",\"#\",3))+2,10))-1)/100,\"\")","v":-2.53E-2},{"$f":"IFERROR(MID(VLOOKUP($C11,Tabelle2!$C:$D,2,FALSE),FIND(\"#\",SUBSTITUTE(VLOOKUP($C11,Tabelle2!$C:$D,2,FALSE),\"\"\">\",\"#\",4))+2,FIND(\"%\",MID(VLOOKUP($C11,Tabelle2!$C:$D,2,FALSE),FIND(\"#\",SUBSTITUTE(VLOOKUP($C11,Tabelle2!$C:$D,2,FALSE),\"\"\">\",\"#\",4))+2,10))-1)/100,\"\")","v":8.3499999999999991E-2},{"$f":"IFERROR(MID(VLOOKUP($C11,Tabelle2!$C:$D,2,FALSE),FIND(\"#\",SUBSTITUTE(VLOOKUP($C11,Tabelle2!$C:$D,2,FALSE),\"\"\">\",\"#\",5))+2,FIND(\"%\",MID(VLOOKUP($C11,Tabelle2!$C:$D,2,FALSE),FIND(\"#\",SUBSTITUTE(VLOOKUP($C11,Tabelle2!$C:$D,2,FALSE),\"\"\">\",\"#\",5))+2,10))-1)/100,\"\")","v":0.45700000000000002}]
["iShares MSCI World UCITS ETF (Dist)","A0HGV0","IE00B0M62Q58",{"$f":"IFERROR(MID(VLOOKUP($C12,Tabelle2!$C:$D,2,FALSE),FIND(\"#\",SUBSTITUTE(VLOOKUP($C12,Tabelle2!$C:$D,2,FALSE),\"\"\">\",\"#\",1))+2,FIND(\"%\",MID(VLOOKUP($C12,Tabelle2!$C:$D,2,FALSE),FIND(\"#\",SUBSTITUTE(VLOOKUP($C12,Tabelle2!$C:$D,2,FALSE),\"\"\">\",\"#\",1))+2,10))-1)/100,\"\")","v":6.83E-2},{"$f":"IFERROR(MID(VLOOKUP($C12,Tabelle2!$C:$D,2,FALSE),FIND(\"#\",SUBSTITUTE(VLOOKUP($C12,Tabelle2!$C:$D,2,FALSE),\"\"\">\",\"#\",2))+2,FIND(\"%\",MID(VLOOKUP($C12,Tabelle2!$C:$D,2,FALSE),FIND(\"#\",SUBSTITUTE(VLOOKUP($C12,Tabelle2!$C:$D,2,FALSE),\"\"\">\",\"#\",2))+2,10))-1)/100,\"\")","v":1.9900000000000001E-2},{"$f":"IFERROR(MID(VLOOKUP($C12,Tabelle2!$C:$D,2,FALSE),FIND(\"#\",SUBSTITUTE(VLOOKUP($C12,Tabelle2!$C:$D,2,FALSE),\"\"\">\",\"#\",3))+2,FIND(\"%\",MID(VLOOKUP($C12,Tabelle2!$C:$D,2,FALSE),FIND(\"#\",SUBSTITUTE(VLOOKUP($C12,Tabelle2!$C:$D,2,FALSE),\"\"\">\",\"#\",3))+2,10))-1)/100,\"\")","v":-2.5099999999999997E-2},{"$f":"IFERROR(MID(VLOOKUP($C12,Tabelle2!$C:$D,2,FALSE),FIND(\"#\",SUBSTITUTE(VLOOKUP($C12,Tabelle2!$C:$D,2,FALSE),\"\"\">\",\"#\",4))+2,FIND(\"%\",MID(VLOOKUP($C12,Tabelle2!$C:$D,2,FALSE),FIND(\"#\",SUBSTITUTE(VLOOKUP($C12,Tabelle2!$C:$D,2,FALSE),\"\"\">\",\"#\",4))+2,10))-1)/100,\"\")","v":8.2200000000000009E-2},{"$f":"IFERROR(MID(VLOOKUP($C12,Tabelle2!$C:$D,2,FALSE),FIND(\"#\",SUBSTITUTE(VLOOKUP($C12,Tabelle2!$C:$D,2,FALSE),\"\"\">\",\"#\",5))+2,FIND(\"%\",MID(VLOOKUP($C12,Tabelle2!$C:$D,2,FALSE),FIND(\"#\",SUBSTITUTE(VLOOKUP($C12,Tabelle2!$C:$D,2,FALSE),\"\"\">\",\"#\",5))+2,10))-1)/100,\"\")","v":0.4526}]

{"sheet":"Tabelle2","index":1,"n_rows":12,"n_cols":4,"rows_kept":12,"cut":false,"hidden":false,"merged":[]}
[]
["Name","WKN","ISIN","jETFTurboString"]
["iShares Core MSCI World UCITS ETF USD (Acc)","A0RPWH","IE00B4L5Y983",{"$f":"jETFPerfString($C3)","v":"\n\t\t    <tr>\n\t\t\t    <td class=\"val green\" id=\"id26\">6,88%</td>\n\t\t\t    <td class=\"val column-priority-2 green\" id=\"id27\">2,05%</td>\n\t\t\t    <td class=\"val red\" id=\"id28\">-2,39%</td>\n\t\t\t    <td class=\"val green\" id=\"id29\">8,51%</td>\n\t\t\t    <td class=\"val green\" id=\"id2a\">46,20%</td>\n\t\t    </tr>\n\t\t</tbod"}]
["ComStage MSCI World TRN UCITS ETF","ETF110","LU0392494562","\n\t\t    <tr>\n\t\t\t    <td class=\"val green\" id=\"id26\">7,12%</td>\n\t\t\t    <td class=\"val column-priority-2 green\" id=\"id27\">2,09%</td>\n\t\t\t    <td class=\"val red\" id=\"id28\">-2,36%</td>\n\t\t\t    <td class=\"val green\" id=\"id29\">8,62%</td>\n\t\t\t    <td class=\"val green\" id=\"id2a\">46,08%</td>\n\t\t    </tr>\n\t\t</tbod"]
["Lyxor MSCI World UCITS ETF D-EUR","LYX0AG","FR0010315770","\n\t\t    <tr>\n\t\t\t    <td class=\"val green\" id=\"id26\">6,87%</td>\n\t\t\t    <td class=\"val column-priority-2 green\" id=\"id27\">2,13%</td>\n\t\t\t    <td class=\"val red\" id=\"id28\">-2,73%</td>\n\t\t\t    <td class=\"val green\" id=\"id29\">8,94%</td>\n\t\t\t    <td class=\"val green\" id=\"id2a\">45,53%</td>\n\t\t    </tr>\n\t\t</tbod"]
["HSBC MSCI WORLD UCITS ETF","A1C9KL","DE000A1C9KL8","\n\t\t    <tr>\n\t\t\t    <td class=\"val green\" id=\"id25\">6,92%</td>\n\t\t\t    <td class=\"val column-priority-2 green\" id=\"id26\">2,16%</td>\n\t\t\t    <td class=\"val red\" id=\"id27\">-2,21%</td>\n\t\t\t    <td class=\"val green\" id=\"id28\">8,94%</td>\n\t\t\t    <td class=\"val green\" id=\"id29\">47,09%</td>\n\t\t    </tr>\n\t\t</tbod"]
["Amundi MSCI World UCITS ETF - EUR (C)","A2H59Q","LU1681043599","\n\t\t    <tr>\n\t\t\t    <td class=\"val green\" id=\"id25\">6,85%</td>\n\t\t\t    <td class=\"val column-priority-2 green\" id=\"id26\">2,11%</td>\n\t\t\t    <td class=\"val red\" id=\"id27\">-2,78%</td>\n\t\t\t    <td class=\"val green\" id=\"id28\">8,84%</td>\n\t\t\t    <td class=\"val green\" id=\"id29\">45,07%</td>\n\t\t    </tr>\n\t\t</tbod"]
["Xtrackers MSCI World Index UCITS ETF 1D","A1XEY2","IE00BK1PV551","\n\t\t    <tr>\n\t\t\t    <td class=\"val green\" id=\"id25\">6,86%</td>\n\t\t\t    <td class=\"val column-priority-2 green\" id=\"id26\">2,04%</td>\n\t\t\t    <td class=\"val red\" id=\"id27\">-2,42%</td>\n\t\t\t    <td class=\"val green\" id=\"id28\">8,49%</td>\n\t\t\t    <td class=\"val green\" id=\"id29\">46,14%</td>\n\t\t    </tr>\n\t\t</tbod"]
["Xtrackers MSCI World Index UCITS ETF 1C","A1XB5U","IE00BJ0KDQ92","\n\t\t    <tr>\n\t\t\t    <td class=\"val green\" id=\"id25\">6,86%</td>\n\t\t\t    <td class=\"val column-priority-2 green\" id=\"id26\">2,03%</td>\n\t\t\t    <td class=\"val red\" id=\"id27\">-2,43%</td>\n\t\t\t    <td class=\"val green\" id=\"id28\">8,51%</td>\n\t\t\t    <td class=\"val green\" id=\"id29\">46,18%</td>\n\t\t    </tr>\n\t\t</tbod"]
["Invesco MSCI World UCITS ETF","A0RGCS","IE00B60SX394",{"$f":"jETFPerfString($C10)","v":"\n\t\t    <tr>\n\t\t\t    <td class=\"val green\" id=\"id25\">6,82%</td>\n\t\t\t    <td class=\"val column-priority-2 green\" id=\"id26\">2,00%</td>\n\t\t\t    <td class=\"val red\" id=\"id27\">-2,43%</td>\n\t\t\t    <td class=\"val green\" id=\"id28\">8,48%</td>\n\t\t\t    <td class=\"val green\" id=\"id29\">45,97%</td>\n\t\t    </tr>\n\t\t</tbod"}]
["UBS ETF (IE) MSCI World UCITS ETF (USD) A-dis","A1JVCA","IE00B7KQ7B66",{"$f":"jETFPerfString($C11)","v":"\n\t\t    <tr>\n\t\t\t    <td class=\"val green\" id=\"id26\">6,82%</td>\n\t\t\t    <td class=\"val column-priority-2 green\" id=\"id27\">1,98%</td>\n\t\t\t    <td class=\"val red\" id=\"id28\">-2,53%</td>\n\t\t\t    <td class=\"val green\" id=\"id29\">8,35%</td>\n\t\t\t    <td class=\"val green\" id=\"id2a\">45,70%</td>\n\t\t    </tr>\n\t\t</tbod"}]
["iShares MSCI World UCITS ETF (Dist)","A0HGV0","IE00B0M62Q58","\n\t\t    <tr>\n\t\t\t    <td class=\"val green\" id=\"id26\">6,83%</td>\n\t\t\t    <td class=\"val column-priority-2 green\" id=\"id27\">1,99%</td>\n\t\t\t    <td class=\"val red\" id=\"id28\">-2,51%</td>\n\t\t\t    <td class=\"val green\" id=\"id29\">8,22%</td>\n\t\t\t    <td class=\"val green\" id=\"id2a\">45,26%</td>\n\t\t    </tr>\n\t\t</tbod"]