{"text_format":"1","workbook":"xlsx","n_sheets":2,"sheets":["Tabelle1","Tabelle2"],"not_rendered":{"charts":0,"images":1,"macros":1,"external_links":0,"defined_names":9,"comments":0,"pivot_tables":0},"unopened":[],"bounds":{"document_bytes":16777216,"sheet_cells":100000,"rows_first":2000,"rows_last":500,"rows_between":2000,"halvings":0,"cell_chars":16384,"cell_head_chars":4096},"cells_cut":0,"cells_raw":0,"read":"whole","date_system":"1900"}

{"sheet":"Tabelle1","index":0,"n_rows":11,"n_cols":11,"rows_kept":11,"cut":false,"hidden":false,"merged":[]}
[]
["historische Performance"]
["Name","WKN","ISIN","7 Tage","1 Monat","3 Monate","lfd. Jahr","6 Monate","1 Jahr","3 Jahre","5 Jahre"]
["ComStage MSCI World TRN UCITS ETF","ETF110","LU0392494562",{"$f":"IF(ISNA(INDEX(Tabelle2!$A:$K,MATCH($C4,Tabelle2!$C:$C,0),MATCH(D$3,Tabelle2!$2:$2,0))),\"\",INDEX(Tabelle2!$A:$K,MATCH($C4,Tabelle2!$C:$C,0),MATCH(D$3,Tabelle2!$2:$2,0)))","v":2.9999999999999997E-4},{"$f":"IF(ISNA(INDEX(Tabelle2!$A:$K,MATCH($C4,Tabelle2!$C:$C,0),MATCH(E$3,Tabelle2!$2:$2,0))),\"\",INDEX(Tabelle2!$A:$K,MATCH($C4,Tabelle2!$C:$C,0),MATCH(E$3,Tabelle2!$2:$2,0)))","v":7.1800000000000003E-2},{"$f":"IF(ISNA(INDEX(Tabelle2!$A:$K,MATCH($C4,Tabelle2!$C:$C,0),MATCH(F$3,Tabelle2!$2:$2,0))),\"\",INDEX(Tabelle2!$A:$K,MATCH($C4,Tabelle2!$C:$C,0),MATCH(F$3,Tabelle2!$2:$2,0)))","v":0.28039999999999998},{"$f":"IF(ISNA(INDEX(Tabelle2!$A:$K,MATCH($C4,Tabelle2!$C:$C,0),MATCH(G$3,Tabelle2!$2:$2,0))),\"\",INDEX(Tabelle2!$A:$K,MATCH($C4,Tabelle2!$C:$C,0),MATCH(G$3,Tabelle2!$2:$2,0)))","v":-4.7899999999999998E-2},{"$f":"IF(ISNA(INDEX(Tabelle2!$A:$K,MATCH($C4,Tabelle2!$C:$C,0),MATCH(H$3,Tabelle2!$2:$2,0))),\"\",INDEX(Tabelle2!$A:$K,MATCH($C4,Tabelle2!$C:$C,0),MATCH(H$3,Tabelle2!$2:$2,0)))","v":-4.6600000000000003E-2},{"$f":"IF(ISNA(INDEX(Tabelle2!$A:$K,MATCH($C4,Tabelle2!$C:$C,0),MATCH(I$3,Tabelle2!$2:$2,0))),\"\",INDEX(Tabelle2!$A:$K,MATCH($C4,Tabelle2!$C:$C,0),MATCH(I$3,Tabelle2!$2:$2,0)))","v":3.61E-2},{"$f":"IF(ISNA(INDEX(Tabelle2!$A:$K,MATCH($C4,Tabelle2!$C:$C,0),MATCH(J$3,Tabelle2!$2:$2,0))),\"\",INDEX(Tabelle2!$A:$K,MATCH($C4,Tabelle2!$C:$C,0),MATCH(J$3,Tabelle2!$2:$2,0)))","v":0.21690000000000001},{"$f":"IF(ISNA(INDEX(Tabelle2!$A:$K,MATCH($C4,Tabelle2!$C:$C,0),MATCH(K$3,Tabelle2!$2:$2,0))),\"\",INDEX(Tabelle2!$A:$K,MATCH($C4,Tabelle2!$C:$C,0),MATCH(K$3,Tabelle2!$2:$2,0)))","v":0.36670000000000003}]
["iShares Core MSCI World UCITS ETF USD (Acc)","A0RPWH","IE00B4L5Y983",{"$f":"IF(ISNA(INDEX(Tabelle2!$A:$K,MATCH($C5,Tabelle2!$C:$C,0),MATCH(D$3,Tabelle2!$2:$2,0))),\"\",INDEX(Tabelle2!$A:$K,MATCH($C5,Tabelle2!$C:$C,0),MATCH(D$3,Tabelle2!$2:$2,0)))","v":9.4999999999999998E-3},{"$f":"IF(ISNA(INDEX(Tabelle2!$A:$K,MATCH($C5,Tabelle2!$C:$C,0),MATCH(E$3,Tabelle2!$2:$2,0))),\"\",INDEX(Tabelle2!$A:$K,MATCH($C5,Tabelle2!$C:$C,0),MATCH(E$3,Tabelle2!$2:$2,0)))","v":5.8900000000000001E-2},{"$f":"IF(ISNA(INDEX(Tabelle2!$A:$K,MATCH($C5,Tabelle2!$C:$C,0),MATCH(F$3,Tabelle2!$2:$2,0))),\"\",INDEX(Tabelle2!$A:$K,MATCH($C5,Tabelle2!$C:$C,0),MATCH(F$3,Tabelle2!$2:$2,0)))","v":0.25940000000000002},{"$f":"IF(ISNA(INDEX(Tabelle2!$A:$K,MATCH($C5,Tabelle2!$C:$C,0),MATCH(G$3,Tabelle2!$2:$2,0))),\"\",INDEX(Tabelle2!$A:$K,MATCH($C5,Tabelle2!$C:$C,0),MATCH(G$3,Tabelle2!$2:$2,0)))","v":-4.0899999999999999E-2},{"$f":"IF(ISNA(INDEX(Tabelle2!$A:$K,MATCH($C5,Tabelle2!$C:$C,0),MATCH(H$3,Tabelle2!$2:$2,0))),\"\",INDEX(Tabelle2!$A:$K,MATCH($C5,Tabelle2!$C:$C,0),MATCH(H$3,Tabelle2!$2:$2,0)))","v":-3.9600000000000003E-2},{"$f":"IF(ISNA(INDEX(Tabelle2!$A:$K,MATCH($C5,Tabelle2!$C:$C,0),MATCH(I$3,Tabelle2!$2:$2,0))),\"\",INDEX(Tabelle2!$A:$K,MATCH($C5,Tabelle2!$C:$C,0),MATCH(I$3,Tabelle2!$2:$2,0)))","v":5.1900000000000002E-2},{"$f":"IF(ISNA(INDEX(Tabelle2!$A:$K,MATCH($C5,Tabelle2!$C:$C,0),MATCH(J$3,Tabelle2!$2:$2,0))),\"\",INDEX(Tabelle2!$A:$K,MATCH($C5,Tabelle2!$C:$C,0),MATCH(J$3,Tabelle2!$2:$2,0)))","v":0.2316},{"$f":"IF(ISNA(INDEX(Tabelle2!$A:$K,MATCH($C5,Tabelle2!$C:$C,0),MATCH(K$3,Tabelle2!$2:$2,0))),\"\",INDEX(Tabelle2!$A:$K,MATCH($C5,Tabelle2!$C:$C,0),MATCH(K$3,Tabelle2!$2:$2,0)))","v":0.38669999999999999}]
["Flossbach v. Storch Multiple Opp. R","A0M430","LU0323578657",{"$f":"IF(ISNA(INDEX(Tabelle2!$A:$K,MATCH($C6,Tabelle2!$C:$C,0),MATCH(D$3,Tabelle2!$2:$2,0))),\"\",INDEX(Tabelle2!$A:$K,MATCH($C6,Tabelle2!$C:$C,0),MATCH(D$3,Tabelle2!$2:$2,0)))","v":7.0000000000000001E-3},{"$f":"IF(ISNA(INDEX(Tabelle2!$A:$K,MATCH($C6,Tabelle2!$C:$C,0),MATCH(E$3,Tabelle2!$2:$2,0))),\"\",INDEX(Tabelle2!$A:$K,MATCH($C6,Tabelle2!$C:$C,0),MATCH(E$3,Tabelle2!$2:$2,0)))","v":4.7000000000000002E-3},{"$f":"IF(ISNA(INDEX(Tabelle2!$A:$K,MATCH($C6,Tabelle2!$C:$C,0),MATCH(F$3,Tabelle2!$2:$2,0))),\"\",INDEX(Tabelle2!$A:$K,MATCH($C6,Tabelle2!$C:$C,0),MATCH(F$3,Tabelle2!$2:$2,0)))","v":7.3499999999999996E-2},{"$f":"IF(ISNA(INDEX(Tabelle2!$A:$K,MATCH($C6,Tabelle2!$C:$C,0),MATCH(G$3,Tabelle2!$2:$2,0))),\"\",INDEX(Tabelle2!$A:$K,MATCH($C6,Tabelle2!$C:$C,0),MATCH(G$3,Tabelle2!$2:$2,0)))","v":-1.4999999999999999E-2},{"$f":"IF(ISNA(INDEX(Tabelle2!$A:$K,MATCH($C6,Tabelle2!$C:$C,0),MATCH(H$3,Tabelle2!$2:$2,0))),\"\",INDEX(Tabelle2!$A:$K,MATCH($C6,Tabelle2!$C:$C,0),MATCH(H$3,Tabelle2!$2:$2,0)))","v":-1.18E-2},{"$f":"IF(ISNA(INDEX(Tabelle2!$A:$K,MATCH($C6,Tabelle2!$C:$C,0),MATCH(I$3,Tabelle2!$2:$2,0))),\"\",INDEX(Tabelle2!$A:$K,MATCH($C6,Tabelle2!$C:$C,0),MATCH(I$3,Tabelle2!$2:$2,0)))","v":5.5800000000000002E-2},{"$f":"IF(ISNA(INDEX(Tabelle2!$A:$K,MATCH($C6,Tabelle2!$C:$C,0),MATCH(J$3,Tabelle2!$2:$2,0))),\"\",INDEX(Tabelle2!$A:$K,MATCH($C6,Tabelle2!$C:$C,0),MATCH(J$3,Tabelle2!$2:$2,0)))","v":0.1464},{"$f":"IF(ISNA(INDEX(Tabelle2!$A:$K,MATCH($C6,Tabelle2!$C:$C,0),MATCH(K$3,Tabelle2!$2:$2,0))),\"\",INDEX(Tabelle2!$A:$K,MATCH($C6,Tabelle2!$C:$C,0),MATCH(K$3,Tabelle2!$2:$2,0)))","v":0.2712}]
["Frankfurter Aktienfonds für Stiftungen T EUR","A0M8HD","DE000A0M8HD2",{"$f":"IF(ISNA(INDEX(Tabelle2!$A:$K,MATCH($C7,Tabelle2!$C:$C,0),MATCH(D$3,Tabelle2!$2:$2,0))),\"\",INDEX(Tabelle2!$A:$K,MATCH($C7,Tabelle2!$C:$C,0),MATCH(D$3,Tabelle2!$2:$2,0)))","v":4.4999999999999997E-3},{"$f":"IF(ISNA(INDEX(Tabelle2!$A:$K,MATCH($C7,Tabelle2!$C:$C,0),MATCH(E$3,Tabelle2!$2:$2,0))),\"\",INDEX(Tabelle2!$A:$K,MATCH($C7,Tabelle2!$C:$C,0),MATCH(E$3,Tabelle2!$2:$2,0)))","v":3.2099999999999997E-2},{"$f":"IF(ISNA(INDEX(Tabelle2!$A:$K,MATCH($C7,Tabelle2!$C:$C,0),MATCH(F$3,Tabelle2!$2:$2,0))),\"\",INDEX(Tabelle2!$A:$K,MATCH($C7,Tabelle2!$C:$C,0),MATCH(F$3,Tabelle2!$2:$2,0)))","v":0.155},{"$f":"IF(ISNA(INDEX(Tabelle2!$A:$K,MATCH($C7,Tabelle2!$C:$C,0),MATCH(G$3,Tabelle2!$2:$2,0))),\"\",INDEX(Tabelle2!$A:$K,MATCH($C7,Tabelle2!$C:$C,0),MATCH(G$3,Tabelle2!$2:$2,0)))","v":-0.1198},{"$f":"IF(ISNA(INDEX(Tabelle2!$A:$K,MATCH($C7,Tabelle2!$C:$C,0),MATCH(H$3,Tabelle2!$2:$2,0))),\"\",INDEX(Tabelle2!$A:$K,MATCH($C7,Tabelle2!$C:$C,0),MATCH(H$3,Tabelle2!$2:$2,0)))","v":-0.1181},{"$f":"IF(ISNA(INDEX(Tabelle2!$A:$K,MATCH($C7,Tabelle2!$C:$C,0),MATCH(I$3,Tabelle2!$2:$2,0))),\"\",INDEX(Tabelle2!$A:$K,MATCH($C7,Tabelle2!$C:$C,0),MATCH(I$3,Tabelle2!$2:$2,0)))","v":-4.2700000000000002E-2},{"$f":"IF(ISNA(INDEX(Tabelle2!$A:$K,MATCH($C7,Tabelle2!$C:$C,0),MATCH(J$3,Tabelle2!$2:$2,0))),\"\",INDEX(Tabelle2!$A:$K,MATCH($C7,Tabelle2!$C:$C,0),MATCH(J$3,Tabelle2!$2:$2,0)))","v":-0.159},{"$f":"IF(ISNA(INDEX(Tabelle2!$A:$K,MATCH($C7,Tabelle2!$C:$C,0),MATCH(K$3,Tabelle2!$2:$2,0))),\"\",INDEX(Tabelle2!$A:$K,MATCH($C7,Tabelle2!$C:$C,0),MATCH(K$3,Tabelle2!$2:$2,0)))","v":3.1300000000000001E-2}]
[]
["Erläuterung der Formel:"]
["=INDEX(Tabelle2!$A$:$K;VERGLEICH($C4;Tabelle2!$C:$C;0);VERGLEICH(E$3;Tabelle2!$2:$2;0))"]
["=INDEX(Bereich in dem in Tabelle2 die Daten stehen ; Suche nach der Zeilennummer in Tabelle2, in der die ISIN steht ; Suche nach der Spaltennummer in Tabelle2, die die die gleiche Bezeichnung, wie die aktuelle Spalte hat)"]

{"sheet":"Tabelle2","index":1,"n_rows":6,"n_cols":11,"rows_kept":6,"cut":false,"hidden":false,"merged":[]}
["historische Performance"]
["Name","WKN","ISIN","7 Tage","1 Monat","3 Monate","lfd. Jahr","6 Monate","1 Jahr","3 Jahre","5 Jahre"]
["ComStage MSCI World TRN UCITS ETF","ETF110","LU0392494562",2.9999999999999997E-4,7.1800000000000003E-2,0.28039999999999998,-4.7899999999999998E-2,-4.6600000000000003E-2,3.61E-2,0.21690000000000001,0.36670000000000003]
["iShares Core MSCI World UCITS ETF USD (Acc)","A0RPWH","IE00B4L5Y983",9.4999999999999998E-3,5.8900000000000001E-2,0.25940000000000002,-4.0899999999999999E-2,-3.9600000000000003E-2,5.1900000000000002E-2,0.2316,0.38669999999999999]
["Flossbach v. Storch Multiple Opp. R","A0M430","LU0323578657",7.0000000000000001E-3,4.7000000000000002E-3,7.3499999999999996E-2,-1.4999999999999999E-2,-1.18E-2,5.5800000000000002E-2,0.1464,0.2712]
["Frankfurter Aktienfonds fÃ¼r Stiftungen T EUR","A0M8HD","DE000A0M8HD2",4.4999999999999997E-3,3.2099999999999997E-2,0.155,-0.1198,-0.1181,-4.2700000000000002E-2,-0.159,3.1300000000000001E-2]