{"text_format":"1","workbook":"xlsx","n_sheets":4,"sheets":["Depot","Sonstiges","Daten","Buchungen"],"not_rendered":{"charts":0,"images":1,"macros":1,"external_links":0,"defined_names":2,"comments":0,"pivot_tables":0},"unopened":[],"bounds":{"document_bytes":16777216,"sheet_cells":100000,"rows_first":2000,"rows_last":500,"rows_between":2000,"halvings":0,"cell_chars":16384,"cell_head_chars":4096},"cells_cut":0,"cells_raw":0,"read":"whole","date_system":"1900"}

{"sheet":"Depot","index":0,"n_rows":13,"n_cols":12,"rows_kept":13,"cut":false,"hidden":false,"merged":[[0,8,0,9]]}
["ISIN","Name","Stk.","Kaufkurs","Kaufvolumen","Gebühren","akt. Kurs","Volumen","Entwicklung",null,"Ausschüttungen","Rendite p.a."]
["Sonstiges"]
["US0378331005","Apple",14,{"$f":"(E3-F3)/C3","v":213.18428571428572},2972.2,-12.38,{"$f":"LEFT(VLOOKUP(A3,Daten!$1:$1048576,2),LEN(VLOOKUP(A3,Daten!$1:$1048576,2))-4)*1","v":247.8},{"$f":"C3*G3","v":3469.2000000000003},{"$f":"H3-(C3*D3)","v":484.62000000000035},{"$f":"H3/(C3*D3)-1","v":0.1623746054721269}]
["Dividendenstrategie"]
[]
["RK 3"]
["DE000ENAG999","E.ON AG",null,null,null,null,{"$f":"LEFT(VLOOKUP(A7,Daten!$1:$1048576,2),LEN(VLOOKUP(A7,Daten!$1:$1048576,2))-4)*1","v":22.954999999999998}]
["RK 2",null,null,null,null,null,{"$f":"LEFT(Daten!B3,LEN(Daten!B3)-4)*1","v":{"$error":"#VALUE!"}}]
[1234567890,"ABC",{"$f":"SUMIFS(Buchungen!E:E,Buchungen!B:B,Depot!A9,Buchungen!D:D,\"Kauf\")","v":0}]
[124,null,{"$f":"SUMIFS(Buchungen!E:E,Buchungen!B:B,Depot!A10,Buchungen!D:D,\"Kauf\")","v":0}]
[12345,null,{"$f":"SUMIFS(Buchungen!E:E,Buchungen!B:B,Depot!A11,Buchungen!D:D,\"Kauf\")","v":0}]
[123,null,{"$f":"SUMIFS(Buchungen!E:E,Buchungen!B:B,Depot!A12,Buchungen!D:D,\"Kauf\")","v":0}]
["RK 1",null,{"$f":"SUMIFS(Buchungen!E:E,Buchungen!B:B,Depot!A13,Buchungen!D:D,\"Kauf\")","v":0}]

{"sheet":"Sonstiges","index":1,"n_rows":326,"n_cols":7,"rows_kept":326,"cut":false,"hidden":false,"merged":[]}
[null,"Datum","ISIN","Name","Art","Anzahl","Betrag"]
[{"$f":"MATCH(\"Sonstiges\",Buchungen!G:G,0)","v":4},{"$f":"IF($A2=\"\",\"\",INDEX(Buchungen!A:A,$A2))","v":"2010-01-20"},{"$f":"IF($A2=\"\",\"\",INDEX(Buchungen!B:B,$A2))","v":"FR0010168773"},{"$f":"IF($A2=\"\",\"\",INDEX(Buchungen!C:C,$A2))","v":21},{"$f":"IF($A2=\"\",\"\",INDEX(Buchungen!D:D,$A2))","v":"B"},{"$f":"IF($A2=\"\",\"\",INDEX(Buchungen!E:E,$A2))","v":"Kauf"},{"$f":"IF($A2=\"\",\"\",INDEX(Buchungen!F:F,$A2))","v":-3133.2}]
[{"$f":"IF(ROW()>COUNTIF(Buchungen!G:G,\"Sonstiges\"),\"\",A2+MATCH(\"Sonstiges\",INDIRECT(\"Buchungen!G\"&A2+1&\":G\"&65536-A2),0))","v":5},{"$f":"IF($A3=\"\",\"\",INDEX(Buchungen!A:A,$A3))","v":"2010-01-20"},{"$f":"IF($A3=\"\",\"\",INDEX(Buchungen!B:B,$A3))","v":"FR0010168773"},{"$f":"IF($A3=\"\",\"\",INDEX(Buchungen!C:C,$A3))","v":21},{"$f":"IF($A3=\"\",\"\",INDEX(Buchungen!D:D,$A3))","v":"B"},{"$f":"IF($A3=\"\",\"\",INDEX(Buchungen!E:E,$A3))","v":"Gebühren"},{"$f":"IF($A3=\"\",\"\",INDEX(Buchungen!F:F,$A3))","v":-13.73}]
[{"$f":"IF(ROW()>COUNTIF(Buchungen!G:G,\"Sonstiges\"),\"\",A3+MATCH(\"Sonstiges\",INDIRECT(\"Buchungen!G\"&A3+1&\":G\"&65536-A3),0))","v":10},{"$f":"IF($A4=\"\",\"\",INDEX(Buchungen!A:A,$A4))","v":"2010-01-21"},{"$f":"IF($A4=\"\",\"\",INDEX(Buchungen!B:B,$A4))","v":"FR0010245514"},{"$f":"IF($A4=\"\",\"\",INDEX(Buchungen!C:C,$A4))","v":64},{"$f":"IF($A4=\"\",\"\",INDEX(Buchungen!D:D,$A4))","v":"E"},{"$f":"IF($A4=\"\",\"\",INDEX(Buchungen!E:E,$A4))","v":"Kauf"},{"$f":"IF($A4=\"\",\"\",INDEX(Buchungen!F:F,$A4))","v":-4694.3999999999996}]
[{"$f":"IF(ROW()>COUNTIF(Buchungen!G:G,\"Sonstiges\"),\"\",A4+MATCH(\"Sonstiges\",INDIRECT(\"Buchungen!G\"&A4+1&\":G\"&65536-A4),0))","v":""},{"$f":"IF($A5=\"\",\"\",INDEX(Buchungen!A:A,$A5))","v":""},{"$f":"IF($A5=\"\",\"\",INDEX(Buchungen!B:B,$A5))","v":""},{"$f":"IF($A5=\"\",\"\",INDEX(Buchungen!C:C,$A5))","v":""},{"$f":"IF($A5=\"\",\"\",INDEX(Buchungen!D:D,$A5))","v":""},{"$f":"IF($A5=\"\",\"\",INDEX(Buchungen!E:E,$A5))","v":""},{"$f":"IF($A5=\"\",\"\",INDEX(Buchungen!F:F,$A5))","v":""}]
[{"$f":"IF(ROW()>COUNTIF(Buchungen!G:G,\"Sonstiges\"),\"\",A5+MATCH(\"Sonstiges\",INDIRECT(\"Buchungen!G\"&A5+1&\":G\"&65536-A5),0))","v":""},{"$f":"IF($A6=\"\",\"\",INDEX(Buchungen!A:A,$A6))","v":""},{"$f":"IF($A6=\"\",\"\",INDEX(Buchungen!B:B,$A6))","v":""},{"$f":"IF($A6=\"\",\"\",INDEX(Buchungen!C:C,$A6))","v":""},{"$f":"IF($A6=\"\",\"\",INDEX(Buchungen!D:D,$A6))","v":""},{"$f":"IF($A6=\"\",\"\",INDEX(Buchungen!E:E,$A6))","v":""},{"$f":"IF($A6=\"\",\"\",INDEX(Buchungen!F:F,$A6))","v":""}]
[{"$f":"IF(ROW()>COUNTIF(Buchungen!G:G,\"Sonstiges\"),\"\",A6+MATCH(\"Sonstiges\",INDIRECT(\"Buchungen!G\"&A6+1&\":G\"&65536-A6),0))","v":""},{"$f":"IF($A7=\"\",\"\",INDEX(Buchungen!A:A,$A7))","v":""},{"$f":"IF($A7=\"\",\"\",INDEX(Buchungen!B:B,$A7))","v":""},{"$f":"IF($A7=\"\",\"\",INDEX(Buchungen!C:C,$A7))","v":""},{"$f":"IF($A7=\"\",\"\",INDEX(Buchungen!D:D,$A7))","v":""},{"$f":"IF($A7=\"\",\"\",INDEX(Buchungen!E:E,$A7))","v":""},{"$f":"IF($A7=\"\",\"\",INDEX(Buchungen!F:F,$A7))","v":""}]
[{"$f":"IF(ROW()>COUNTIF(Buchungen!G:G,\"Sonstiges\"),\"\",A7+MATCH(\"Sonstiges\",INDIRECT(\"Buchungen!G\"&A7+1&\":G\"&65536-A7),0))","v":""},{"$f":"IF($A8=\"\",\"\",INDEX(Buchungen!A:A,$A8))","v":""},{"$f":"IF($A8=\"\",\"\",INDEX(Buchungen!B:B,$A8))","v":""},{"$f":"IF($A8=\"\",\"\",INDEX(Buchungen!C:C,$A8))","v":""},{"$f":"IF($A8=\"\",\"\",INDEX(Buchungen!D:D,$A8))","v":""},{"$f":"IF($A8=\"\",\"\",INDEX(Buchungen!E:E,$A8))","v":""},{"$f":"IF($A8=\"\",\"\",INDEX(Buchungen!F:F,$A8))","v":""}]
[{"$f":"IF(ROW()>COUNTIF(Buchungen!G:G,\"Sonstiges\"),\"\",A8+MATCH(\"Sonstiges\",INDIRECT(\"Buchungen!G\"&A8+1&\":G\"&65536-A8),0))","v":""},{"$f":"IF($A9=\"\",\"\",INDEX(Buchungen!A:A,$A9))","v":""},{"$f":"IF($A9=\"\",\"\",INDEX(Buchungen!B:B,$A9))","v":""},{"$f":"IF($A9=\"\",\"\",INDEX(Buchungen!C:C,$A9))","v":""},{"$f":"IF($A9=\"\",\"\",INDEX(Buchungen!D:D,$A9))","v":""},{"$f":"IF($A9=\"\",\"\",INDEX(Buchungen!E:E,$A9))","v":""},{"$f":"IF($A9=\"\",\"\",INDEX(Buchungen!F:F,$A9))","v":""}]
[{"$f":"IF(ROW()>COUNTIF(Buchungen!G:G,\"Sonstiges\"),\"\",A9+MATCH(\"Sonstiges\",INDIRECT(\"Buchungen!G\"&A9+1&\":G\"&65536-A9),0))","v":""},{"$f":"IF($A10=\"\",\"\",INDEX(Buchungen!A:A,$A10))","v":""},{"$f":"IF($A10=\"\",\"\",INDEX(Buchungen!B:B,$A10))","v":""},{"$f":"IF($A10=\"\",\"\",INDEX(Buchungen!C:C,$A10))","v":""},{"$f":"IF($A10=\"\",\"\",INDEX(Buchungen!D:D,$A10))","v":""},{"$f":"IF($A10=\"\",\"\",INDEX(Buchungen!E:E,$A10))","v":""},{"$f":"IF($A10=\"\",\"\",INDEX(Buchungen!F:F,$A10))","v":""}]
[{"$f":"IF(ROW()>COUNTIF(Buchungen!G:G,\"Sonstiges\"),\"\",A10+MATCH(\"Sonstiges\",INDIRECT(\"Buchungen!G\"&A10+1&\":G\"&65536-A10),0))","v":""},{"$f":"IF($A11=\"\",\"\",INDEX(Buchungen!A:A,$A11))","v":""},{"$f":"IF($A11=\"\",\"\",INDEX(Buchungen!B:B,$A11))","v":""},{"$f":"IF($A11=\"\",\"\",INDEX(Buchungen!C:C,$A11))","v":""},{"$f":"IF($A11=\"\",\"\",INDEX(Buchungen!D:D,$A11))","v":""},{"$f":"IF($A11=\"\",\"\",INDEX(Buchungen!E:E,$A11))","v":""},{"$f":"IF($A11=\"\",\"\",INDEX(Buchungen!F:F,$A11))","v":""}]
[{"$f":"IF(ROW()>COUNTIF(Buchungen!G:G,\"Sonstiges\"),\"\",A11+MATCH(\"Sonstiges\",INDIRECT(\"Buchungen!G\"&A11+1&\":G\"&65536-A11),0))","v":""},{"$f":"IF($A12=\"\",\"\",INDEX(Buchungen!A:A,$A12))","v":""},{"$f":"IF($A12=\"\",\"\",INDEX(Buchungen!B:B,$A12))","v":""},{"$f":"IF($A12=\"\",\"\",INDEX(Buchungen!C:C,$A12))","v":""},{"$f":"IF($A12=\"\",\"\",INDEX(Buchungen!D:D,$A12))","v":""},{"$f":"IF($A12=\"\",\"\",INDEX(Buchungen!E:E,$A12))","v":""},{"$f":"IF($A12=\"\",\"\",INDEX(Buchungen!F:F,$A12))","v":""}]
[{"$f":"IF(ROW()>COUNTIF(Buchungen!G:G,\"Sonstiges\"),\"\",A12+MATCH(\"Sonstiges\",INDIRECT(\"Buchungen!G\"&A12+1&\":G\"&65536-A12),0))","v":""},{"$f":"IF($A13=\"\",\"\",INDEX(Buchungen!A:A,$A13))","v":""},{"$f":"IF($A13=\"\",\"\",INDEX(Buchungen!B:B,$A13))","v":""},{"$f":"IF($A13=\"\",\"\",INDEX(Buchungen!C:C,$A13))","v":""},{"$f":"IF($A13=\"\",\"\",INDEX(Buchungen!D:D,$A13))","v":""},{"$f":"IF($A13=\"\",\"\",INDEX(Buchungen!E:E,$A13))","v":""},{"$f":"IF($A13=\"\",\"\",INDEX(Buchungen!F:F,$A13))","v":""}]
[{"$f":"IF(ROW()>COUNTIF(Buchungen!G:G,\"Sonstiges\"),\"\",A13+MATCH(\"Sonstiges\",INDIRECT(\"Buchungen!G\"&A13+1&\":G\"&65536-A13),0))","v":""},{"$f":"IF($A14=\"\",\"\",INDEX(Buchungen!A:A,$A14))","v":""},{"$f":"IF($A14=\"\",\"\",INDEX(Buchungen!B:B,$A14))","v":""},{"$f":"IF($A14=\"\",\"\",INDEX(Buchungen!C:C,$A14))","v":""},{"$f":"IF($A14=\"\",\"\",INDEX(Buchungen!D:D,$A14))","v":""},{"$f":"IF($A14=\"\",\"\",INDEX(Buchungen!E:E,$A14))","v":""},{"$f":"IF($A14=\"\",\"\",INDEX(Buchungen!F:F,$A14))","v":""}]
[{"$f":"IF(ROW()>COUNTIF(Buchungen!G:G,\"Sonstiges\"),\"\",A14+MATCH(\"Sonstiges\",INDIRECT(\"Buchungen!G\"&A14+1&\":G\"&65536-A14),0))","v":""},{"$f":"IF($A15=\"\",\"\",INDEX(Buchungen!A:A,$A15))","v":""},{"$f":"IF($A15=\"\",\"\",INDEX(Buchungen!B:B,$A15))","v":""},{"$f":"IF($A15=\"\",\"\",INDEX(Buchungen!C:C,$A15))","v":""},{"$f":"IF($A15=\"\",\"\",INDEX(Buchungen!D:D,$A15))","v":""},{"$f":"IF($A15=\"\",\"\",INDEX(Buchungen!E:E,$A15))","v":""},{"$f":"IF($A15=\"\",\"\",INDEX(Buchungen!F:F,$A15))","v":""}]
[{"$f":"IF(ROW()>COUNTIF(Buchungen!G:G,\"Sonstiges\"),\"\",A15+MATCH(\"Sonstiges\",INDIRECT(\"Buchungen!G\"&A15+1&\":G\"&65536-A15),0))","v":""},{"$f":"IF($A16=\"\",\"\",INDEX(Buchungen!A:A,$A16))","v":""},{"$f":"IF($A16=\"\",\"\",INDEX(Buchungen!B:B,$A16))","v":""},{"$f":"IF($A16=\"\",\"\",INDEX(Buchungen!C:C,$A16))","v":""},{"$f":"IF($A16=\"\",\"\",INDEX(Buchungen!D:D,$A16))","v":""},{"$f":"IF($A16=\"\",\"\",INDEX(Buchungen!E:E,$A16))","v":""},{"$f":"IF($A16=\"\",\"\",INDEX(Buchungen!F:F,$A16))","v":""}]
[{"$f":"IF(ROW()>COUNTIF(Buchungen!G:G,\"Sonstiges\"),\"\",A16+MATCH(\"Sonstiges\",INDIRECT(\"Buchungen!G\"&A16+1&\":G\"&65536-A16),0))","v":""},{"$f":"IF($A17=\"\",\"\",INDEX(Buchungen!A:A,$A17))","v":""},{"$f":"IF($A17=\"\",\"\",INDEX(Buchungen!B:B,$A17))","v":""},{"$f":"IF($A17=\"\",\"\",INDEX(Buchungen!C:C,$A17))","v":""},{"$f":"IF($A17=\"\",\"\",INDEX(Buchungen!D:D,$A17))","v":""},{"$f":"IF($A17=\"\",\"\",INDEX(Buchungen!E:E,$A17))","v":""},{"$f":"IF($A17=\"\",\"\",INDEX(Buchungen!F:F,$A17))","v":""}]
[{"$f":"IF(ROW()>COUNTIF(Buchungen!G:G,\"Sonstiges\"),\"\",A17+MATCH(\"Sonstiges\",INDIRECT(\"Buchungen!G\"&A17+1&\":G\"&65536-A17),0))","v":""},{"$f":"IF($A18=\"\",\"\",INDEX(Buchungen!A:A,$A18))","v":""},{"$f":"IF($A18=\"\",\"\",INDEX(Buchungen!B:B,$A18))","v":""},{"$f":"IF($A18=\"\",\"\",INDEX(Buchungen!C:C,$A18))","v":""},{"$f":"IF($A18=\"\",\"\",INDEX(Buchungen!D:D,$A18))","v":""},{"$f":"IF($A18=\"\",\"\",INDEX(Buchungen!E:E,$A18))","v":""},{"$f":"IF($A18=\"\",\"\",INDEX(Buchungen!F:F,$A18))","v":""}]
[{"$f":"IF(ROW()>COUNTIF(Buchungen!G:G,\"Sonstiges\"),\"\",A18+MATCH(\"Sonstiges\",INDIRECT(\"Buchungen!G\"&A18+1&\":G\"&65536-A18),0))","v":""},{"$f":"IF($A19=\"\",\"\",INDEX(Buchungen!A:A,$A19))","v":""},{"$f":"IF($A19=\"\",\"\",INDEX(Buchungen!B:B,$A19))","v":""},{"$f":"IF($A19=\"\",\"\",INDEX(Buchungen!C:C,$A19))","v":""},{"$f":"IF($A19=\"\",\"\",INDEX(Buchungen!D:D,$A19))","v":""},{"$f":"IF($A19=\"\",\"\",INDEX(Buchungen!E:E,$A19))","v":""},{"$f":"IF($A19=\"\",\"\",INDEX(Buchungen!F:F,$A19))","v":""}]
[{"$f":"IF(ROW()>COUNTIF(Buchungen!G:G,\"Sonstiges\"),\"\",A19+MATCH(\"Sonstiges\",INDIRECT(\"Buchungen!G\"&A19+1&\":G\"&65536-A19),0))","v":""},{"$f":"IF($A20=\"\",\"\",INDEX(Buchungen!A:A,$A20))","v":""},{"$f":"IF($A20=\"\",\"\",INDEX(Buchungen!B:B,$A20))","v":""},{"$f":"IF($A20=\"\",\"\",INDEX(Buchungen!C:C,$A20))","v":""},{"$f":"IF($A20=\"\",\"\",INDEX(Buchungen!D:D,$A20))","v":""},{"$f":"IF($A20=\"\",\"\",INDEX(Buchungen!E:E,$A20))","v":""},{"$f":"IF($A20=\"\",\"\",INDEX(Buchungen!F:F,$A20))","v":""}]
[{"$f":"IF(ROW()>COUNTIF(Buchungen!G:G,\"Sonstiges\"),\"\",A20+MATCH(\"Sonstiges\",INDIRECT(\"Buchungen!G\"&A20+1&\":G\"&65536-A20),0))","v":""},{"$f":"IF($A21=\"\",\"\",INDEX(Buchungen!A:A,$A21))","v":""},{"$f":"IF($A21=\"\",\"\",INDEX(Buchungen!B:B,$A21))","v":""},{"$f":"IF($A21=\"\",\"\",INDEX(Buchungen!C:C,$A21))","v":""},{"$f":"IF($A21=\"\",\"\",INDEX(Buchungen!D:D,$A21))","v":""},{"$f":"IF($A21=\"\",\"\",INDEX(Buchungen!E:E,$A21))","v":""},{"$f":"IF($A21=\"\",\"\",INDEX(Buchungen!F:F,$A21))","v":""}]
[{"$f":"IF(ROW()>COUNTIF(Buchungen!G:G,\"Sonstiges\"),\"\",A21+MATCH(\"Sonstiges\",INDIRECT(\"Buchungen!G\"&A21+1&\":G\"&65536-A21),0))","v":""},{"$f":"IF($A22=\"\",\"\",INDEX(Buchungen!A:A,$A22))","v":""},{"$f":"IF($A22=\"\",\"\",INDEX(Buchungen!B:B,$A22))","v":""},{"$f":"IF($A22=\"\",\"\",INDEX(Buchungen!C:C,$A22))","v":""},{"$f":"IF($A22=\"\",\"\",INDEX(Buchungen!D:D,$A22))","v":""},{"$f":"IF($A22=\"\",\"\",INDEX(Buchungen!E:E,$A22))","v":""},{"$f":"IF($A22=\"\",\"\",INDEX(Buchungen!F:F,$A22))","v":""}]
[{"$f":"IF(ROW()>COUNTIF(Buchungen!G:G,\"Sonstiges\"),\"\",A22+MATCH(\"Sonstiges\",INDIRECT(\"Buchungen!G\"&A22+1&\":G\"&65536-A22),0))","v":""},{"$f":"IF($A23=\"\",\"\",INDEX(Buchungen!A:A,$A23))","v":""},{"$f":"IF($A23=\"\",\"\",INDEX(Buchungen!B:B,$A23))","v":""},{"$f":"IF($A23=\"\",\"\",INDEX(Buchungen!C:C,$A23))","v":""},{"$f":"IF($A23=\"\",\"\",INDEX(Buchungen!D:D,$A23))","v":""},{"$f":"IF($A23=\"\",\"\",INDEX(Buchungen!E:E,$A23))","v":""},{"$f":"IF($A23=\"\",\"\",INDEX(Buchungen!F:F,$A23))","v":""}]
[{"$f":"IF(ROW()>COUNTIF(Buchungen!G:G,\"Sonstiges\"),\"\",A23+MATCH(\"Sonstiges\",INDIRECT(\"Buchungen!G\"&A23+1&\":G\"&65536-A23),0))","v":""},{"$f":"IF($A24=\"\",\"\",INDEX(Buchungen!A:A,$A24))","v":""},{"$f":"IF($A24=\"\",\"\",INDEX(Buchungen!B:B,$A24))","v":""},{"$f":"IF($A24=\"\",\"\",INDEX(Buchungen!C:C,$A24))","v":""},{"$f":"IF($A24=\"\",\"\",INDEX(Buchungen!D:D,$A24))","v":""},{"$f":"IF($A24=\"\",\"\",INDEX(Buchungen!E:E,$A24))","v":""},{"$f":"IF($A24=\"\",\"\",INDEX(Buchungen!F:F,$A24))","v":""}]
[{"$f":"IF(ROW()>COUNTIF(Buchungen!G:G,\"Sonstiges\"),\"\",A24+MATCH(\"Sonstiges\",INDIRECT(\"Buchungen!G\"&A24+1&\":G\"&65536-A24),0))","v":""},{"$f":"IF($A25=\"\",\"\",INDEX(Buchungen!A:A,$A25))","v":""},{"$f":"IF($A25=\"\",\"\",INDEX(Buchungen!B:B,$A25))","v":""},{"$f":"IF($A25=\"\",\"\",INDEX(Buchungen!C:C,$A25))","v":""},{"$f":"IF($A25=\"\",\"\",INDEX(Buchungen!D:D,$A25))","v":""},{"$f":"IF($A25=\"\",\"\",INDEX(Buchungen!E:E,$A25))","v":""},{"$f":"IF($A25=\"\",\"\",INDEX(Buchungen!F:F,$A25))","v":""}]
[{"$f":"IF(ROW()>COUNTIF(Buchungen!G:G,\"Sonstiges\"),\"\",A25+MATCH(\"Sonstiges\",INDIRECT(\"Buchungen!G\"&A25+1&\":G\"&65536-A25),0))","v":""},{"$f":"IF($A26=\"\",\"\",INDEX(Buchungen!A:A,$A26))","v":""},{"$f":"IF($A26=\"\",\"\",INDEX(Buchungen!B:B,$A26))","v":""},{"$f":"IF($A26=\"\",\"\",INDEX(Buchungen!C:C,$A26))","v":""},{"$f":"IF($A26=\"\",\"\",INDEX(Buchungen!D:D,$A26))","v":""},{"$f":"IF($A26=\"\",\"\",INDEX(Buchungen!E:E,$A26))","v":""},{"$f":"IF($A26=\"\",\"\",INDEX(Buchungen!F:F,$A26))","v":""}]
[{"$f":"IF(ROW()>COUNTIF(Buchungen!G:G,\"Sonstiges\"),\"\",A26+MATCH(\"Sonstiges\",INDIRECT(\"Buchungen!G\"&A26+1&\":G\"&65536-A26),0))","v":""},{"$f":"IF($A27=\"\",\"\",INDEX(Buchungen!A:A,$A27))","v":""},{"$f":"IF($A27=\"\",\"\",INDEX(Buchungen!B:B,$A27))","v":""},{"$f":"IF($A27=\"\",\"\",INDEX(Buchungen!C:C,$A27))","v":""},{"$f":"IF($A27=\"\",\"\",INDEX(Buchungen!D:D,$A27))","v":""},{"$f":"IF($A27=\"\",\"\",INDEX(Buchungen!E:E,$A27))","v":""},{"$f":"IF($A27=\"\",\"\",INDEX(Buchungen!F:F,$A27))","v":""}]
[{"$f":"IF(ROW()>COUNTIF(Buchungen!G:G,\"Sonstiges\"),\"\",A27+MATCH(\"Sonstiges\",INDIRECT(\"Buchungen!G\"&A27+1&\":G\"&65536-A27),0))","v":""},{"$f":"IF($A28=\"\",\"\",INDEX(Buchungen!A:A,$A28))","v":""},{"$f":"IF($A28=\"\",\"\",INDEX(Buchungen!B:B,$A28))","v":""},{"$f":"IF($A28=\"\",\"\",INDEX(Buchungen!C:C,$A28))","v":""},{"$f":"IF($A28=\"\",\"\",INDEX(Buchungen!D:D,$A28))","v":""},{"$f":"IF($A28=\"\",\"\",INDEX(Buchungen!E:E,$A28))","v":""},{"$f":"IF($A28=\"\",\"\",INDEX(Buchungen!F:F,$A28))","v":""}]
[{"$f":"IF(ROW()>COUNTIF(Buchungen!G:G,\"Sonstiges\"),\"\",A28+MATCH(\"Sonstiges\",INDIRECT(\"Buchungen!G\"&A28+1&\":G\"&65536-A28),0))","v":""},{"$f":"IF($A29=\"\",\"\",INDEX(Buchungen!A:A,$A29))","v":""},{"$f":"IF($A29=\"\",\"\",INDEX(Buchungen!B:B,$A29))","v":""},{"$f":"IF($A29=\"\",\"\",INDEX(Buchungen!C:C,$A29))","v":""},{"$f":"IF($A29=\"\",\"\",INDEX(Buchungen!D:D,$A29))","v":""},{"$f":"IF($A29=\"\",\"\",INDEX(Buchungen!E:E,$A29))","v":""},{"$f":"IF($A29=\"\",\"\",INDEX(Buchungen!F:F,$A29))","v":""}]
[{"$f":"IF(ROW()>COUNTIF(Buchungen!G:G,\"Sonstiges\"),\"\",A29+MATCH(\"Sonstiges\",INDIRECT(\"Buchungen!G\"&A29+1&\":G\"&65536-A29),0))","v":""},{"$f":"IF($A30=\"\",\"\",INDEX(Buchungen!A:A,$A30))","v":""},{"$f":"IF($A30=\"\",\"\",INDEX(Buchungen!B:B,$A30))","v":""},{"$f":"IF($A30=\"\",\"\",INDEX(Buchungen!C:C,$A30))","v":""},{"$f":"IF($A30=\"\",\"\",INDEX(Buchungen!D:D,$A30))","v":""},{"$f":"IF($A30=\"\",\"\",INDEX(Buchungen!E:E,$A30))","v":""},{"$f":"IF($A30=\"\",\"\",INDEX(Buchungen!F:F,$A30))","v":""}]
[{"$f":"IF(ROW()>COUNTIF(Buchungen!G:G,\"Sonstiges\"),\"\",A30+MATCH(\"Sonstiges\",INDIRECT(\"Buchungen!G\"&A30+1&\":G\"&65536-A30),0))","v":""},{"$f":"IF($A31=\"\",\"\",INDEX(Buchungen!A:A,$A31))","v":""},{"$f":"IF($A31=\"\",\"\",INDEX(Buchungen!B:B,$A31))","v":""},{"$f":"IF($A31=\"\",\"\",INDEX(Buchungen!C:C,$A31))","v":""},{"$f":"IF($A31=\"\",\"\",INDEX(Buchungen!D:D,$A31))","v":""},{"$f":"IF($A31=\"\",\"\",INDEX(Buchungen!E:E,$A31))","v":""},{"$f":"IF($A31=\"\",\"\",INDEX(Buchungen!F:F,$A31))","v":""}]
[{"$f":"IF(ROW()>COUNTIF(Buchungen!G:G,\"Sonstiges\"),\"\",A31+MATCH(\"Sonstiges\",INDIRECT(\"Buchungen!G\"&A31+1&\":G\"&65536-A31),0))","v":""},{"$f":"IF($A32=\"\",\"\",INDEX(Buchungen!A:A,$A32))","v":""},{"$f":"IF($A32=\"\",\"\",INDEX(Buchungen!B:B,$A32))","v":""},{"$f":"IF($A32=\"\",\"\",INDEX(Buchungen!C:C,$A32))","v":""},{"$f":"IF($A32=\"\",\"\",INDEX(Buchungen!D:D,$A32))","v":""},{"$f":"IF($A32=\"\",\"\",INDEX(Buchungen!E:E,$A32))","v":""},{"$f":"IF($A32=\"\",\"\",INDEX(Buchungen!F:F,$A32))","v":""}]
[{"$f":"IF(ROW()>COUNTIF(Buchungen!G:G,\"Sonstiges\"),\"\",A32+MATCH(\"Sonstiges\",INDIRECT(\"Buchungen!G\"&A32+1&\":G\"&65536-A32),0))","v":""},{"$f":"IF($A33=\"\",\"\",INDEX(Buchungen!A:A,$A33))","v":""},{"$f":"IF($A33=\"\",\"\",INDEX(Buchungen!B:B,$A33))","v":""},{"$f":"IF($A33=\"\",\"\",INDEX(Buchungen!C:C,$A33))","v":""},{"$f":"IF($A33=\"\",\"\",INDEX(Buchungen!D:D,$A33))","v":""},{"$f":"IF($A33=\"\",\"\",INDEX(Buchungen!E:E,$A33))","v":""},{"$f":"IF($A33=\"\",\"\",INDEX(Buchungen!F:F,$A33))","v":""}]
[{"$f":"IF(ROW()>COUNTIF(Buchungen!G:G,\"Sonstiges\"),\"\",A33+MATCH(\"Sonstiges\",INDIRECT(\"Buchungen!G\"&A33+1&\":G\"&65536-A33),0))","v":""},{"$f":"IF($A34=\"\",\"\",INDEX(Buchungen!A:A,$A34))","v":""},{"$f":"IF($A34=\"\",\"\",INDEX(Buchungen!B:B,$A34))","v":""},{"$f":"IF($A34=\"\",\"\",INDEX(Buchungen!C:C,$A34))","v":""},{"$f":"IF($A34=\"\",\"\",INDEX(Buchungen!D:D,$A34))","v":""},{"$f":"IF($A34=\"\",\"\",INDEX(Buchungen!E:E,$A34))","v":""},{"$f":"IF($A34=\"\",\"\",INDEX(Buchungen!F:F,$A34))","v":""}]
[{"$f":"IF(ROW()>COUNTIF(Buchungen!G:G,\"Sonstiges\"),\"\",A34+MATCH(\"Sonstiges\",INDIRECT(\"Buchungen!G\"&A34+1&\":G\"&65536-A34),0))","v":""},{"$f":"IF($A35=\"\",\"\",INDEX(Buchungen!A:A,$A35))","v":""},{"$f":"IF($A35=\"\",\"\",INDEX(Buchungen!B:B,$A35))","v":""},{"$f":"IF($A35=\"\",\"\",INDEX(Buchungen!C:C,$A35))","v":""},{"$f":"IF($A35=\"\",\"\",INDEX(Buchungen!D:D,$A35))","v":""},{"$f":"IF($A35=\"\",\"\",INDEX(Buchungen!E:E,$A35))","v":""},{"$f":"IF($A35=\"\",\"\",INDEX(Buchungen!F:F,$A35))","v":""}]
[{"$f":"IF(ROW()>COUNTIF(Buchungen!G:G,\"Sonstiges\"),\"\",A35+MATCH(\"Sonstiges\",INDIRECT(\"Buchungen!G\"&A35+1&\":G\"&65536-A35),0))","v":""},{"$f":"IF($A36=\"\",\"\",INDEX(Buchungen!A:A,$A36))","v":""},{"$f":"IF($A36=\"\",\"\",INDEX(Buchungen!B:B,$A36))","v":""},{"$f":"IF($A36=\"\",\"\",INDEX(Buchungen!C:C,$A36))","v":""},{"$f":"IF($A36=\"\",\"\",INDEX(Buchungen!D:D,$A36))","v":""},{"$f":"IF($A36=\"\",\"\",INDEX(Buchungen!E:E,$A36))","v":""},{"$f":"IF($A36=\"\",\"\",INDEX(Buchungen!F:F,$A36))","v":""}]
[{"$f":"IF(ROW()>COUNTIF(Buchungen!G:G,\"Sonstiges\"),\"\",A36+MATCH(\"Sonstiges\",INDIRECT(\"Buchungen!G\"&A36+1&\":G\"&65536-A36),0))","v":""},{"$f":"IF($A37=\"\",\"\",INDEX(Buchungen!A:A,$A37))","v":""},{"$f":"IF($A37=\"\",\"\",INDEX(Buchungen!B:B,$A37))","v":""},{"$f":"IF($A37=\"\",\"\",INDEX(Buchungen!C:C,$A37))","v":""},{"$f":"IF($A37=\"\",\"\",INDEX(Buchungen!D:D,$A37))","v":""},{"$f":"IF($A37=\"\",\"\",INDEX(Buchungen!E:E,$A37))","v":""},{"$f":"IF($A37=\"\",\"\",INDEX(Buchungen!F:F,$A37))","v":""}]
[{"$f":"IF(ROW()>COUNTIF(Buchungen!G:G,\"Sonstiges\"),\"\",A37+MATCH(\"Sonstiges\",INDIRECT(\"Buchungen!G\"&A37+1&\":G\"&65536-A37),0))","v":""},{"$f":"IF($A38=\"\",\"\",INDEX(Buchungen!A:A,$A38))","v":""},{"$f":"IF($A38=\"\",\"\",INDEX(Buchungen!B:B,$A38))","v":""},{"$f":"IF($A38=\"\",\"\",INDEX(Buchungen!C:C,$A38))","v":""},{"$f":"IF($A38=\"\",\"\",INDEX(Buchungen!D:D,$A38))","v":""},{"$f":"IF($A38=\"\",\"\",INDEX(Buchungen!E:E,$A38))","v":""},{"$f":"IF($A38=\"\",\"\",INDEX(Buchungen!F:F,$A38))","v":""}]
[{"$f":"IF(ROW()>COUNTIF(Buchungen!G:G,\"Sonstiges\"),\"\",A38+MATCH(\"Sonstiges\",INDIRECT(\"Buchungen!G\"&A38+1&\":G\"&65536-A38),0))","v":""},{"$f":"IF($A39=\"\",\"\",INDEX(Buchungen!A:A,$A39))","v":""},{"$f":"IF($A39=\"\",\"\",INDEX(Buchungen!B:B,$A39))","v":""},{"$f":"IF($A39=\"\",\"\",INDEX(Buchungen!C:C,$A39))","v":""},{"$f":"IF($A39=\"\",\"\",INDEX(Buchungen!D:D,$A39))","v":""},{"$f":"IF($A39=\"\",\"\",INDEX(Buchungen!E:E,$A39))","v":""},{"$f":"IF($A39=\"\",\"\",INDEX(Buchungen!F:F,$A39))","v":""}]
[{"$f":"IF(ROW()>COUNTIF(Buchungen!G:G,\"Sonstiges\"),\"\",A39+MATCH(\"Sonstiges\",INDIRECT(\"Buchungen!G\"&A39+1&\":G\"&65536-A39),0))","v":""},{"$f":"IF($A40=\"\",\"\",INDEX(Buchungen!A:A,$A40))","v":""},{"$f":"IF($A40=\"\",\"\",INDEX(Buchungen!B:B,$A40))","v":""},{"$f":"IF($A40=\"\",\"\",INDEX(Buchungen!C:C,$A40))","v":""},{"$f":"IF($A40=\"\",\"\",INDEX(Buchungen!D:D,$A40))","v":""},{"$f":"IF($A40=\"\",\"\",INDEX(Buchungen!E:E,$A40))","v":""},{"$f":"IF($A40=\"\",\"\",INDEX(Buchungen!F:F,$A40))","v":""}]
[{"$f":"IF(ROW()>COUNTIF(Buchungen!G:G,\"Sonstiges\"),\"\",A40+MATCH(\"Sonstiges\",INDIRECT(\"Buchungen!G\"&A40+1&\":G\"&65536-A40),0))","v":""},{"$f":"IF($A41=\"\",\"\",INDEX(Buchungen!A:A,$A41))","v":""},{"$f":"IF($A41=\"\",\"\",INDEX(Buchungen!B:B,$A41))","v":""},{"$f":"IF($A41=\"\",\"\",INDEX(Buchungen!C:C,$A41))","v":""},{"$f":"IF($A41=\"\",\"\",INDEX(Buchungen!D:D,$A41))","v":""},{"$f":"IF($A41=\"\",\"\",INDEX(Buchungen!E:E,$A41))","v":""},{"$f":"IF($A41=\"\",\"\",INDEX(Buchungen!F:F,$A41))","v":""}]
[{"$f":"IF(ROW()>COUNTIF(Buchungen!G:G,\"Sonstiges\"),\"\",A41+MATCH(\"Sonstiges\",INDIRECT(\"Buchungen!G\"&A41+1&\":G\"&65536-A41),0))","v":""},{"$f":"IF($A42=\"\",\"\",INDEX(Buchungen!A:A,$A42))","v":""},{"$f":"IF($A42=\"\",\"\",INDEX(Buchungen!B:B,$A42))","v":""},{"$f":"IF($A42=\"\",\"\",INDEX(Buchungen!C:C,$A42))","v":""},{"$f":"IF($A42=\"\",\"\",INDEX(Buchungen!D:D,$A42))","v":""},{"$f":"IF($A42=\"\",\"\",INDEX(Buchungen!E:E,$A42))","v":""},{"$f":"IF($A42=\"\",\"\",INDEX(Buchungen!F:F,$A42))","v":""}]
[{"$f":"IF(ROW()>COUNTIF(Buchungen!G:G,\"Sonstiges\"),\"\",A42+MATCH(\"Sonstiges\",INDIRECT(\"Buchungen!G\"&A42+1&\":G\"&65536-A42),0))","v":""},{"$f":"IF($A43=\"\",\"\",INDEX(Buchungen!A:A,$A43))","v":""},{"$f":"IF($A43=\"\",\"\",INDEX(Buchungen!B:B,$A43))","v":""},{"$f":"IF($A43=\"\",\"\",INDEX(Buchungen!C:C,$A43))","v":""},{"$f":"IF($A43=\"\",\"\",INDEX(Buchungen!D:D,$A43))","v":""},{"$f":"IF($A43=\"\",\"\",INDEX(Buchungen!E:E,$A43))","v":""},{"$f":"IF($A43=\"\",\"\",INDEX(Buchungen!F:F,$A43))","v":""}]
[{"$f":"IF(ROW()>COUNTIF(Buchungen!G:G,\"Sonstiges\"),\"\",A43+MATCH(\"Sonstiges\",INDIRECT(\"Buchungen!G\"&A43+1&\":G\"&65536-A43),0))","v":""},{"$f":"IF($A44=\"\",\"\",INDEX(Buchungen!A:A,$A44))","v":""},{"$f":"IF($A44=\"\",\"\",INDEX(Buchungen!B:B,$A44))","v":""},{"$f":"IF($A44=\"\",\"\",INDEX(Buchungen!C:C,$A44))","v":""},{"$f":"IF($A44=\"\",\"\",INDEX(Buchungen!D:D,$A44))","v":""},{"$f":"IF($A44=\"\",\"\",INDEX(Buchungen!E:E,$A44))","v":""},{"$f":"IF($A44=\"\",\"\",INDEX(Buchungen!F:F,$A44))","v":""}]
[{"$f":"IF(ROW()>COUNTIF(Buchungen!G:G,\"Sonstiges\"),\"\",A44+MATCH(\"Sonstiges\",INDIRECT(\"Buchungen!G\"&A44+1&\":G\"&65536-A44),0))","v":""},{"$f":"IF($A45=\"\",\"\",INDEX(Buchungen!A:A,$A45))","v":""},{"$f":"IF($A45=\"\",\"\",INDEX(Buchungen!B:B,$A45))","v":""},{"$f":"IF($A45=\"\",\"\",INDEX(Buchungen!C:C,$A45))","v":""},{"$f":"IF($A45=\"\",\"\",INDEX(Buchungen!D:D,$A45))","v":""},{"$f":"IF($A45=\"\",\"\",INDEX(Buchungen!E:E,$A45))","v":""},{"$f":"IF($A45=\"\",\"\",INDEX(Buchungen!F:F,$A45))","v":""}]
[{"$f":"IF(ROW()>COUNTIF(Buchungen!G:G,\"Sonstiges\"),\"\",A45+MATCH(\"Sonstiges\",INDIRECT(\"Buchungen!G\"&A45+1&\":G\"&65536-A45),0))","v":""},{"$f":"IF($A46=\"\",\"\",INDEX(Buchungen!A:A,$A46))","v":""},{"$f":"IF($A46=\"\",\"\",INDEX(Buchungen!B:B,$A46))","v":""},{"$f":"IF($A46=\"\",\"\",INDEX(Buchungen!C:C,$A46))","v":""},{"$f":"IF($A46=\"\",\"\",INDEX(Buchungen!D:D,$A46))","v":""},{"$f":"IF($A46=\"\",\"\",INDEX(Buchungen!E:E,$A46))","v":""},{"$f":"IF($A46=\"\",\"\",INDEX(Buchungen!F:F,$A46))","v":""}]
[{"$f":"IF(ROW()>COUNTIF(Buchungen!G:G,\"Sonstiges\"),\"\",A46+MATCH(\"Sonstiges\",INDIRECT(\"Buchungen!G\"&A46+1&\":G\"&65536-A46),0))","v":""},{"$f":"IF($A47=\"\",\"\",INDEX(Buchungen!A:A,$A47))","v":""},{"$f":"IF($A47=\"\",\"\",INDEX(Buchungen!B:B,$A47))","v":""},{"$f":"IF($A47=\"\",\"\",INDEX(Buchungen!C:C,$A47))","v":""},{"$f":"IF($A47=\"\",\"\",INDEX(Buchungen!D:D,$A47))","v":""},{"$f":"IF($A47=\"\",\"\",INDEX(Buchungen!E:E,$A47))","v":""},{"$f":"IF($A47=\"\",\"\",INDEX(Buchungen!F:F,$A47))","v":""}]
[{"$f":"IF(ROW()>COUNTIF(Buchungen!G:G,\"Sonstiges\"),\"\",A47+MATCH(\"Sonstiges\",INDIRECT(\"Buchungen!G\"&A47+1&\":G\"&65536-A47),0))","v":""},{"$f":"IF($A48=\"\",\"\",INDEX(Buchungen!A:A,$A48))","v":""},{"$f":"IF($A48=\"\",\"\",INDEX(Buchungen!B:B,$A48))","v":""},{"$f":"IF($A48=\"\",\"\",INDEX(Buchungen!C:C,$A48))","v":""},{"$f":"IF($A48=\"\",\"\",INDEX(Buchungen!D:D,$A48))","v":""},{"$f":"IF($A48=\"\",\"\",INDEX(Buchungen!E:E,$A48))","v":""},{"$f":"IF($A48=\"\",\"\",INDEX(Buchungen!F:F,$A48))","v":""}]
[{"$f":"IF(ROW()>COUNTIF(Buchungen!G:G,\"Sonstiges\"),\"\",A48+MATCH(\"Sonstiges\",INDIRECT(\"Buchungen!G\"&A48+1&\":G\"&65536-A48),0))","v":""},{"$f":"IF($A49=\"\",\"\",INDEX(Buchungen!A:A,$A49))","v":""},{"$f":"IF($A49=\"\",\"\",INDEX(Buchungen!B:B,$A49))","v":""},{"$f":"IF($A49=\"\",\"\",INDEX(Buchungen!C:C,$A49))","v":""},{"$f":"IF($A49=\"\",\"\",INDEX(Buchungen!D:D,$A49))","v":""},{"$f":"IF($A49=\"\",\"\",INDEX(Buchungen!E:E,$A49))","v":""},{"$f":"IF($A49=\"\",\"\",INDEX(Buchungen!F:F,$A49))","v":""}]
[{"$f":"IF(ROW()>COUNTIF(Buchungen!G:G,\"Sonstiges\"),\"\",A49+MATCH(\"Sonstiges\",INDIRECT(\"Buchungen!G\"&A49+1&\":G\"&65536-A49),0))","v":""},{"$f":"IF($A50=\"\",\"\",INDEX(Buchungen!A:A,$A50))","v":""},{"$f":"IF($A50=\"\",\"\",INDEX(Buchungen!B:B,$A50))","v":""},{"$f":"IF($A50=\"\",\"\",INDEX(Buchungen!C:C,$A50))","v":""},{"$f":"IF($A50=\"\",\"\",INDEX(Buchungen!D:D,$A50))","v":""},{"$f":"IF($A50=\"\",\"\",INDEX(Buchungen!E:E,$A50))","v":""},{"$f":"IF($A50=\"\",\"\",INDEX(Buchungen!F:F,$A50))","v":""}]
[{"$f":"IF(ROW()>COUNTIF(Buchungen!G:G,\"Sonstiges\"),\"\",A50+MATCH(\"Sonstiges\",INDIRECT(\"Buchungen!G\"&A50+1&\":G\"&65536-A50),0))","v":""},{"$f":"IF($A51=\"\",\"\",INDEX(Buchungen!A:A,$A51))","v":""},{"$f":"IF($A51=\"\",\"\",INDEX(Buchungen!B:B,$A51))","v":""},{"$f":"IF($A51=\"\",\"\",INDEX(Buchungen!C:C,$A51))","v":""},{"$f":"IF($A51=\"\",\"\",INDEX(Buchungen!D:D,$A51))","v":""},{"$f":"IF($A51=\"\",\"\",INDEX(Buchungen!E:E,$A51))","v":""},{"$f":"IF($A51=\"\",\"\",INDEX(Buchungen!F:F,$A51))","v":""}]
[{"$f":"IF(ROW()>COUNTIF(Buchungen!G:G,\"Sonstiges\"),\"\",A51+MATCH(\"Sonstiges\",INDIRECT(\"Buchungen!G\"&A51+1&\":G\"&65536-A51),0))","v":""},{"$f":"IF($A52=\"\",\"\",INDEX(Buchungen!A:A,$A52))","v":""},{"$f":"IF($A52=\"\",\"\",INDEX(Buchungen!B:B,$A52))","v":""},{"$f":"IF($A52=\"\",\"\",INDEX(Buchungen!C:C,$A52))","v":""},{"$f":"IF($A52=\"\",\"\",INDEX(Buchungen!D:D,$A52))","v":""},{"$f":"IF($A52=\"\",\"\",INDEX(Buchungen!E:E,$A52))","v":""},{"$f":"IF($A52=\"\",\"\",INDEX(Buchungen!F:F,$A52))","v":""}]
[{"$f":"IF(ROW()>COUNTIF(Buchungen!G:G,\"Sonstiges\"),\"\",A52+MATCH(\"Sonstiges\",INDIRECT(\"Buchungen!G\"&A52+1&\":G\"&65536-A52),0))","v":""},{"$f":"IF($A53=\"\",\"\",INDEX(Buchungen!A:A,$A53))","v":""},{"$f":"IF($A53=\"\",\"\",INDEX(Buchungen!B:B,$A53))","v":""},{"$f":"IF($A53=\"\",\"\",INDEX(Buchungen!C:C,$A53))","v":""},{"$f":"IF($A53=\"\",\"\",INDEX(Buchungen!D:D,$A53))","v":""},{"$f":"IF($A53=\"\",\"\",INDEX(Buchungen!E:E,$A53))","v":""},{"$f":"IF($A53=\"\",\"\",INDEX(Buchungen!F:F,$A53))","v":""}]
[{"$f":"IF(ROW()>COUNTIF(Buchungen!G:G,\"Sonstiges\"),\"\",A53+MATCH(\"Sonstiges\",INDIRECT(\"Buchungen!G\"&A53+1&\":G\"&65536-A53),0))","v":""},{"$f":"IF($A54=\"\",\"\",INDEX(Buchungen!A:A,$A54))","v":""},{"$f":"IF($A54=\"\",\"\",INDEX(Buchungen!B:B,$A54))","v":""},{"$f":"IF($A54=\"\",\"\",INDEX(Buchungen!C:C,$A54))","v":""},{"$f":"IF($A54=\"\",\"\",INDEX(Buchungen!D:D,$A54))","v":""},{"$f":"IF($A54=\"\",\"\",INDEX(Buchungen!E:E,$A54))","v":""},{"$f":"IF($A54=\"\",\"\",INDEX(Buchungen!F:F,$A54))","v":""}]
[{"$f":"IF(ROW()>COUNTIF(Buchungen!G:G,\"Sonstiges\"),\"\",A54+MATCH(\"Sonstiges\",INDIRECT(\"Buchungen!G\"&A54+1&\":G\"&65536-A54),0))","v":""},{"$f":"IF($A55=\"\",\"\",INDEX(Buchungen!A:A,$A55))","v":""},{"$f":"IF($A55=\"\",\"\",INDEX(Buchungen!B:B,$A55))","v":""},{"$f":"IF($A55=\"\",\"\",INDEX(Buchungen!C:C,$A55))","v":""},{"$f":"IF($A55=\"\",\"\",INDEX(Buchungen!D:D,$A55))","v":""},{"$f":"IF($A55=\"\",\"\",INDEX(Buchungen!E:E,$A55))","v":""},{"$f":"IF($A55=\"\",\"\",INDEX(Buchungen!F:F,$A55))","v":""}]
[{"$f":"IF(ROW()>COUNTIF(Buchungen!G:G,\"Sonstiges\"),\"\",A55+MATCH(\"Sonstiges\",INDIRECT(\"Buchungen!G\"&A55+1&\":G\"&65536-A55),0))","v":""},{"$f":"IF($A56=\"\",\"\",INDEX(Buchungen!A:A,$A56))","v":""},{"$f":"IF($A56=\"\",\"\",INDEX(Buchungen!B:B,$A56))","v":""},{"$f":"IF($A56=\"\",\"\",INDEX(Buchungen!C:C,$A56))","v":""},{"$f":"IF($A56=\"\",\"\",INDEX(Buchungen!D:D,$A56))","v":""},{"$f":"IF($A56=\"\",\"\",INDEX(Buchungen!E:E,$A56))","v":""},{"$f":"IF($A56=\"\",\"\",INDEX(Buchungen!F:F,$A56))","v":""}]
[{"$f":"IF(ROW()>COUNTIF(Buchungen!G:G,\"Sonstiges\"),\"\",A56+MATCH(\"Sonstiges\",INDIRECT(\"Buchungen!G\"&A56+1&\":G\"&65536-A56),0))","v":""},{"$f":"IF($A57=\"\",\"\",INDEX(Buchungen!A:A,$A57))","v":""},{"$f":"IF($A57=\"\",\"\",INDEX(Buchungen!B:B,$A57))","v":""},{"$f":"IF($A57=\"\",\"\",INDEX(Buchungen!C:C,$A57))","v":""},{"$f":"IF($A57=\"\",\"\",INDEX(Buchungen!D:D,$A57))","v":""},{"$f":"IF($A57=\"\",\"\",INDEX(Buchungen!E:E,$A57))","v":""},{"$f":"IF($A57=\"\",\"\",INDEX(Buchungen!F:F,$A57))","v":""}]
[{"$f":"IF(ROW()>COUNTIF(Buchungen!G:G,\"Sonstiges\"),\"\",A57+MATCH(\"Sonstiges\",INDIRECT(\"Buchungen!G\"&A57+1&\":G\"&65536-A57),0))","v":""},{"$f":"IF($A58=\"\",\"\",INDEX(Buchungen!A:A,$A58))","v":""},{"$f":"IF($A58=\"\",\"\",INDEX(Buchungen!B:B,$A58))","v":""},{"$f":"IF($A58=\"\",\"\",INDEX(Buchungen!C:C,$A58))","v":""},{"$f":"IF($A58=\"\",\"\",INDEX(Buchungen!D:D,$A58))","v":""},{"$f":"IF($A58=\"\",\"\",INDEX(Buchungen!E:E,$A58))","v":""},{"$f":"IF($A58=\"\",\"\",INDEX(Buchungen!F:F,$A58))","v":""}]
[{"$f":"IF(ROW()>COUNTIF(Buchungen!G:G,\"Sonstiges\"),\"\",A58+MATCH(\"Sonstiges\",INDIRECT(\"Buchungen!G\"&A58+1&\":G\"&65536-A58),0))","v":""},{"$f":"IF($A59=\"\",\"\",INDEX(Buchungen!A:A,$A59))","v":""},{"$f":"IF($A59=\"\",\"\",INDEX(Buchungen!B:B,$A59))","v":""},{"$f":"IF($A59=\"\",\"\",INDEX(Buchungen!C:C,$A59))","v":""},{"$f":"IF($A59=\"\",\"\",INDEX(Buchungen!D:D,$A59))","v":""},{"$f":"IF($A59=\"\",\"\",INDEX(Buchungen!E:E,$A59))","v":""},{"$f":"IF($A59=\"\",\"\",INDEX(Buchungen!F:F,$A59))","v":""}]
[{"$f":"IF(ROW()>COUNTIF(Buchungen!G:G,\"Sonstiges\"),\"\",A59+MATCH(\"Sonstiges\",INDIRECT(\"Buchungen!G\"&A59+1&\":G\"&65536-A59),0))","v":""},{"$f":"IF($A60=\"\",\"\",INDEX(Buchungen!A:A,$A60))","v":""},{"$f":"IF($A60=\"\",\"\",INDEX(Buchungen!B:B,$A60))","v":""},{"$f":"IF($A60=\"\",\"\",INDEX(Buchungen!C:C,$A60))","v":""},{"$f":"IF($A60=\"\",\"\",INDEX(Buchungen!D:D,$A60))","v":""},{"$f":"IF($A60=\"\",\"\",INDEX(Buchungen!E:E,$A60))","v":""},{"$f":"IF($A60=\"\",\"\",INDEX(Buchungen!F:F,$A60))","v":""}]
[{"$f":"IF(ROW()>COUNTIF(Buchungen!G:G,\"Sonstiges\"),\"\",A60+MATCH(\"Sonstiges\",INDIRECT(\"Buchungen!G\"&A60+1&\":G\"&65536-A60),0))","v":""},{"$f":"IF($A61=\"\",\"\",INDEX(Buchungen!A:A,$A61))","v":""},{"$f":"IF($A61=\"\",\"\",INDEX(Buchungen!B:B,$A61))","v":""},{"$f":"IF($A61=\"\",\"\",INDEX(Buchungen!C:C,$A61))","v":""},{"$f":"IF($A61=\"\",\"\",INDEX(Buchungen!D:D,$A61))","v":""},{"$f":"IF($A61=\"\",\"\",INDEX(Buchungen!E:E,$A61))","v":""},{"$f":"IF($A61=\"\",\"\",INDEX(Buchungen!F:F,$A61))","v":""}]
[{"$f":"IF(ROW()>COUNTIF(Buchungen!G:G,\"Sonstiges\"),\"\",A61+MATCH(\"Sonstiges\",INDIRECT(\"Buchungen!G\"&A61+1&\":G\"&65536-A61),0))","v":""},{"$f":"IF($A62=\"\",\"\",INDEX(Buchungen!A:A,$A62))","v":""},{"$f":"IF($A62=\"\",\"\",INDEX(Buchungen!B:B,$A62))","v":""},{"$f":"IF($A62=\"\",\"\",INDEX(Buchungen!C:C,$A62))","v":""},{"$f":"IF($A62=\"\",\"\",INDEX(Buchungen!D:D,$A62))","v":""},{"$f":"IF($A62=\"\",\"\",INDEX(Buchungen!E:E,$A62))","v":""},{"$f":"IF($A62=\"\",\"\",INDEX(Buchungen!F:F,$A62))","v":""}]
[{"$f":"IF(ROW()>COUNTIF(Buchungen!G:G,\"Sonstiges\"),\"\",A62+MATCH(\"Sonstiges\",INDIRECT(\"Buchungen!G\"&A62+1&\":G\"&65536-A62),0))","v":""},{"$f":"IF($A63=\"\",\"\",INDEX(Buchungen!A:A,$A63))","v":""},{"$f":"IF($A63=\"\",\"\",INDEX(Buchungen!B:B,$A63))","v":""},{"$f":"IF($A63=\"\",\"\",INDEX(Buchungen!C:C,$A63))","v":""},{"$f":"IF($A63=\"\",\"\",INDEX(Buchungen!D:D,$A63))","v":""},{"$f":"IF($A63=\"\",\"\",INDEX(Buchungen!E:E,$A63))","v":""},{"$f":"IF($A63=\"\",\"\",INDEX(Buchungen!F:F,$A63))","v":""}]
[{"$f":"IF(ROW()>COUNTIF(Buchungen!G:G,\"Sonstiges\"),\"\",A63+MATCH(\"Sonstiges\",INDIRECT(\"Buchungen!G\"&A63+1&\":G\"&65536-A63),0))","v":""},{"$f":"IF($A64=\"\",\"\",INDEX(Buchungen!A:A,$A64))","v":""},{"$f":"IF($A64=\"\",\"\",INDEX(Buchungen!B:B,$A64))","v":""},{"$f":"IF($A64=\"\",\"\",INDEX(Buchungen!C:C,$A64))","v":""},{"$f":"IF($A64=\"\",\"\",INDEX(Buchungen!D:D,$A64))","v":""},{"$f":"IF($A64=\"\",\"\",INDEX(Buchungen!E:E,$A64))","v":""},{"$f":"IF($A64=\"\",\"\",INDEX(Buchungen!F:F,$A64))","v":""}]
[{"$f":"IF(ROW()>COUNTIF(Buchungen!G:G,\"Sonstiges\"),\"\",A64+MATCH(\"Sonstiges\",INDIRECT(\"Buchungen!G\"&A64+1&\":G\"&65536-A64),0))","v":""},{"$f":"IF($A65=\"\",\"\",INDEX(Buchungen!A:A,$A65))","v":""},{"$f":"IF($A65=\"\",\"\",INDEX(Buchungen!B:B,$A65))","v":""},{"$f":"IF($A65=\"\",\"\",INDEX(Buchungen!C:C,$A65))","v":""},{"$f":"IF($A65=\"\",\"\",INDEX(Buchungen!D:D,$A65))","v":""},{"$f":"IF($A65=\"\",\"\",INDEX(Buchungen!E:E,$A65))","v":""},{"$f":"IF($A65=\"\",\"\",INDEX(Buchungen!F:F,$A65))","v":""}]
[{"$f":"IF(ROW()>COUNTIF(Buchungen!G:G,\"Sonstiges\"),\"\",A65+MATCH(\"Sonstiges\",INDIRECT(\"Buchungen!G\"&A65+1&\":G\"&65536-A65),0))","v":""},{"$f":"IF($A66=\"\",\"\",INDEX(Buchungen!A:A,$A66))","v":""},{"$f":"IF($A66=\"\",\"\",INDEX(Buchungen!B:B,$A66))","v":""},{"$f":"IF($A66=\"\",\"\",INDEX(Buchungen!C:C,$A66))","v":""},{"$f":"IF($A66=\"\",\"\",INDEX(Buchungen!D:D,$A66))","v":""},{"$f":"IF($A66=\"\",\"\",INDEX(Buchungen!E:E,$A66))","v":""},{"$f":"IF($A66=\"\",\"\",INDEX(Buchungen!F:F,$A66))","v":""}]
[{"$f":"IF(ROW()>COUNTIF(Buchungen!G:G,\"Sonstiges\"),\"\",A66+MATCH(\"Sonstiges\",INDIRECT(\"Buchungen!G\"&A66+1&\":G\"&65536-A66),0))","v":""},{"$f":"IF($A67=\"\",\"\",INDEX(Buchungen!A:A,$A67))","v":""},{"$f":"IF($A67=\"\",\"\",INDEX(Buchungen!B:B,$A67))","v":""},{"$f":"IF($A67=\"\",\"\",INDEX(Buchungen!C:C,$A67))","v":""},{"$f":"IF($A67=\"\",\"\",INDEX(Buchungen!D:D,$A67))","v":""},{"$f":"IF($A67=\"\",\"\",INDEX(Buchungen!E:E,$A67))","v":""},{"$f":"IF($A67=\"\",\"\",INDEX(Buchungen!F:F,$A67))","v":""}]
[{"$f":"IF(ROW()>COUNTIF(Buchungen!G:G,\"Sonstiges\"),\"\",A67+MATCH(\"Sonstiges\",INDIRECT(\"Buchungen!G\"&A67+1&\":G\"&65536-A67),0))","v":""},{"$f":"IF($A68=\"\",\"\",INDEX(Buchungen!A:A,$A68))","v":""},{"$f":"IF($A68=\"\",\"\",INDEX(Buchungen!B:B,$A68))","v":""},{"$f":"IF($A68=\"\",\"\",INDEX(Buchungen!C:C,$A68))","v":""},{"$f":"IF($A68=\"\",\"\",INDEX(Buchungen!D:D,$A68))","v":""},{"$f":"IF($A68=\"\",\"\",INDEX(Buchungen!E:E,$A68))","v":""},{"$f":"IF($A68=\"\",\"\",INDEX(Buchungen!F:F,$A68))","v":""}]
[{"$f":"IF(ROW()>COUNTIF(Buchungen!G:G,\"Sonstiges\"),\"\",A68+MATCH(\"Sonstiges\",INDIRECT(\"Buchungen!G\"&A68+1&\":G\"&65536-A68),0))","v":""},{"$f":"IF($A69=\"\",\"\",INDEX(Buchungen!A:A,$A69))","v":""},{"$f":"IF($A69=\"\",\"\",INDEX(Buchungen!B:B,$A69))","v":""},{"$f":"IF($A69=\"\",\"\",INDEX(Buchungen!C:C,$A69))","v":""},{"$f":"IF($A69=\"\",\"\",INDEX(Buchungen!D:D,$A69))","v":""},{"$f":"IF($A69=\"\",\"\",INDEX(Buchungen!E:E,$A69))","v":""},{"$f":"IF($A69=\"\",\"\",INDEX(Buchungen!F:F,$A69))","v":""}]
[{"$f":"IF(ROW()>COUNTIF(Buchungen!G:G,\"Sonstiges\"),\"\",A69+MATCH(\"Sonstiges\",INDIRECT(\"Buchungen!G\"&A69+1&\":G\"&65536-A69),0))","v":""},{"$f":"IF($A70=\"\",\"\",INDEX(Buchungen!A:A,$A70))","v":""},{"$f":"IF($A70=\"\",\"\",INDEX(Buchungen!B:B,$A70))","v":""},{"$f":"IF($A70=\"\",\"\",INDEX(Buchungen!C:C,$A70))","v":""},{"$f":"IF($A70=\"\",\"\",INDEX(Buchungen!D:D,$A70))","v":""},{"$f":"IF($A70=\"\",\"\",INDEX(Buchungen!E:E,$A70))","v":""},{"$f":"IF($A70=\"\",\"\",INDEX(Buchungen!F:F,$A70))","v":""}]
[{"$f":"IF(ROW()>COUNTIF(Buchungen!G:G,\"Sonstiges\"),\"\",A70+MATCH(\"Sonstiges\",INDIRECT(\"Buchungen!G\"&A70+1&\":G\"&65536-A70),0))","v":""},{"$f":"IF($A71=\"\",\"\",INDEX(Buchungen!A:A,$A71))","v":""},{"$f":"IF($A71=\"\",\"\",INDEX(Buchungen!B:B,$A71))","v":""},{"$f":"IF($A71=\"\",\"\",INDEX(Buchungen!C:C,$A71))","v":""},{"$f":"IF($A71=\"\",\"\",INDEX(Buchungen!D:D,$A71))","v":""},{"$f":"IF($A71=\"\",\"\",INDEX(Buchungen!E:E,$A71))","v":""},{"$f":"IF($A71=\"\",\"\",INDEX(Buchungen!F:F,$A71))","v":""}]
[{"$f":"IF(ROW()>COUNTIF(Buchungen!G:G,\"Sonstiges\"),\"\",A71+MATCH(\"Sonstiges\",INDIRECT(\"Buchungen!G\"&A71+1&\":G\"&65536-A71),0))","v":""},{"$f":"IF($A72=\"\",\"\",INDEX(Buchungen!A:A,$A72))","v":""},{"$f":"IF($A72=\"\",\"\",INDEX(Buchungen!B:B,$A72))","v":""},{"$f":"IF($A72=\"\",\"\",INDEX(Buchungen!C:C,$A72))","v":""},{"$f":"IF($A72=\"\",\"\",INDEX(Buchungen!D:D,$A72))","v":""},{"$f":"IF($A72=\"\",\"\",INDEX(Buchungen!E:E,$A72))","v":""},{"$f":"IF($A72=\"\",\"\",INDEX(Buchungen!F:F,$A72))","v":""}]
[{"$f":"IF(ROW()>COUNTIF(Buchungen!G:G,\"Sonstiges\"),\"\",A72+MATCH(\"Sonstiges\",INDIRECT(\"Buchungen!G\"&A72+1&\":G\"&65536-A72),0))","v":""},{"$f":"IF($A73=\"\",\"\",INDEX(Buchungen!A:A,$A73))","v":""},{"$f":"IF($A73=\"\",\"\",INDEX(Buchungen!B:B,$A73))","v":""},{"$f":"IF($A73=\"\",\"\",INDEX(Buchungen!C:C,$A73))","v":""},{"$f":"IF($A73=\"\",\"\",INDEX(Buchungen!D:D,$A73))","v":""},{"$f":"IF($A73=\"\",\"\",INDEX(Buchungen!E:E,$A73))","v":""},{"$f":"IF($A73=\"\",\"\",INDEX(Buchungen!F:F,$A73))","v":""}]
[{"$f":"IF(ROW()>COUNTIF(Buchungen!G:G,\"Sonstiges\"),\"\",A73+MATCH(\"Sonstiges\",INDIRECT(\"Buchungen!G\"&A73+1&\":G\"&65536-A73),0))","v":""},{"$f":"IF($A74=\"\",\"\",INDEX(Buchungen!A:A,$A74))","v":""},{"$f":"IF($A74=\"\",\"\",INDEX(Buchungen!B:B,$A74))","v":""},{"$f":"IF($A74=\"\",\"\",INDEX(Buchungen!C:C,$A74))","v":""},{"$f":"IF($A74=\"\",\"\",INDEX(Buchungen!D:D,$A74))","v":""},{"$f":"IF($A74=\"\",\"\",INDEX(Buchungen!E:E,$A74))","v":""},{"$f":"IF($A74=\"\",\"\",INDEX(Buchungen!F:F,$A74))","v":""}]
[{"$f":"IF(ROW()>COUNTIF(Buchungen!G:G,\"Sonstiges\"),\"\",A74+MATCH(\"Sonstiges\",INDIRECT(\"Buchungen!G\"&A74+1&\":G\"&65536-A74),0))","v":""},{"$f":"IF($A75=\"\",\"\",INDEX(Buchungen!A:A,$A75))","v":""},{"$f":"IF($A75=\"\",\"\",INDEX(Buchungen!B:B,$A75))","v":""},{"$f":"IF($A75=\"\",\"\",INDEX(Buchungen!C:C,$A75))","v":""},{"$f":"IF($A75=\"\",\"\",INDEX(Buchungen!D:D,$A75))","v":""},{"$f":"IF($A75=\"\",\"\",INDEX(Buchungen!E:E,$A75))","v":""},{"$f":"IF($A75=\"\",\"\",INDEX(Buchungen!F:F,$A75))","v":""}]
[{"$f":"IF(ROW()>COUNTIF(Buchungen!G:G,\"Sonstiges\"),\"\",A75+MATCH(\"Sonstiges\",INDIRECT(\"Buchungen!G\"&A75+1&\":G\"&65536-A75),0))","v":""},{"$f":"IF($A76=\"\",\"\",INDEX(Buchungen!A:A,$A76))","v":""},{"$f":"IF($A76=\"\",\"\",INDEX(Buchungen!B:B,$A76))","v":""},{"$f":"IF($A76=\"\",\"\",INDEX(Buchungen!C:C,$A76))","v":""},{"$f":"IF($A76=\"\",\"\",INDEX(Buchungen!D:D,$A76))","v":""},{"$f":"IF($A76=\"\",\"\",INDEX(Buchungen!E:E,$A76))","v":""},{"$f":"IF($A76=\"\",\"\",INDEX(Buchungen!F:F,$A76))","v":""}]
[{"$f":"IF(ROW()>COUNTIF(Buchungen!G:G,\"Sonstiges\"),\"\",A76+MATCH(\"Sonstiges\",INDIRECT(\"Buchungen!G\"&A76+1&\":G\"&65536-A76),0))","v":""},{"$f":"IF($A77=\"\",\"\",INDEX(Buchungen!A:A,$A77))","v":""},{"$f":"IF($A77=\"\",\"\",INDEX(Buchungen!B:B,$A77))","v":""},{"$f":"IF($A77=\"\",\"\",INDEX(Buchungen!C:C,$A77))","v":""},{"$f":"IF($A77=\"\",\"\",INDEX(Buchungen!D:D,$A77))","v":""},{"$f":"IF($A77=\"\",\"\",INDEX(Buchungen!E:E,$A77))","v":""},{"$f":"IF($A77=\"\",\"\",INDEX(Buchungen!F:F,$A77))","v":""}]
[{"$f":"IF(ROW()>COUNTIF(Buchungen!G:G,\"Sonstiges\"),\"\",A77+MATCH(\"Sonstiges\",INDIRECT(\"Buchungen!G\"&A77+1&\":G\"&65536-A77),0))","v":""},{"$f":"IF($A78=\"\",\"\",INDEX(Buchungen!A:A,$A78))","v":""},{"$f":"IF($A78=\"\",\"\",INDEX(Buchungen!B:B,$A78))","v":""},{"$f":"IF($A78=\"\",\"\",INDEX(Buchungen!C:C,$A78))","v":""},{"$f":"IF($A78=\"\",\"\",INDEX(Buchungen!D:D,$A78))","v":""},{"$f":"IF($A78=\"\",\"\",INDEX(Buchungen!E:E,$A78))","v":""},{"$f":"IF($A78=\"\",\"\",INDEX(Buchungen!F:F,$A78))","v":""}]
[{"$f":"IF(ROW()>COUNTIF(Buchungen!G:G,\"Sonstiges\"),\"\",A78+MATCH(\"Sonstiges\",INDIRECT(\"Buchungen!G\"&A78+1&\":G\"&65536-A78),0))","v":""},{"$f":"IF($A79=\"\",\"\",INDEX(Buchungen!A:A,$A79))","v":""},{"$f":"IF($A79=\"\",\"\",INDEX(Buchungen!B:B,$A79))","v":""},{"$f":"IF($A79=\"\",\"\",INDEX(Buchungen!C:C,$A79))","v":""},{"$f":"IF($A79=\"\",\"\",INDEX(Buchungen!D:D,$A79))","v":""},{"$f":"IF($A79=\"\",\"\",INDEX(Buchungen!E:E,$A79))","v":""},{"$f":"IF($A79=\"\",\"\",INDEX(Buchungen!F:F,$A79))","v":""}]
[{"$f":"IF(ROW()>COUNTIF(Buchungen!G:G,\"Sonstiges\"),\"\",A79+MATCH(\"Sonstiges\",INDIRECT(\"Buchungen!G\"&A79+1&\":G\"&65536-A79),0))","v":""},{"$f":"IF($A80=\"\",\"\",INDEX(Buchungen!A:A,$A80))","v":""},{"$f":"IF($A80=\"\",\"\",INDEX(Buchungen!B:B,$A80))","v":""},{"$f":"IF($A80=\"\",\"\",INDEX(Buchungen!C:C,$A80))","v":""},{"$f":"IF($A80=\"\",\"\",INDEX(Buchungen!D:D,$A80))","v":""},{"$f":"IF($A80=\"\",\"\",INDEX(Buchungen!E:E,$A80))","v":""},{"$f":"IF($A80=\"\",\"\",INDEX(Buchungen!F:F,$A80))","v":""}]
[{"$f":"IF(ROW()>COUNTIF(Buchungen!G:G,\"Sonstiges\"),\"\",A80+MATCH(\"Sonstiges\",INDIRECT(\"Buchungen!G\"&A80+1&\":G\"&65536-A80),0))","v":""},{"$f":"IF($A81=\"\",\"\",INDEX(Buchungen!A:A,$A81))","v":""},{"$f":"IF($A81=\"\",\"\",INDEX(Buchungen!B:B,$A81))","v":""},{"$f":"IF($A81=\"\",\"\",INDEX(Buchungen!C:C,$A81))","v":""},{"$f":"IF($A81=\"\",\"\",INDEX(Buchungen!D:D,$A81))","v":""},{"$f":"IF($A81=\"\",\"\",INDEX(Buchungen!E:E,$A81))","v":""},{"$f":"IF($A81=\"\",\"\",INDEX(Buchungen!F:F,$A81))","v":""}]
[{"$f":"IF(ROW()>COUNTIF(Buchungen!G:G,\"Sonstiges\"),\"\",A81+MATCH(\"Sonstiges\",INDIRECT(\"Buchungen!G\"&A81+1&\":G\"&65536-A81),0))","v":""},{"$f":"IF($A82=\"\",\"\",INDEX(Buchungen!A:A,$A82))","v":""},{"$f":"IF($A82=\"\",\"\",INDEX(Buchungen!B:B,$A82))","v":""},{"$f":"IF($A82=\"\",\"\",INDEX(Buchungen!C:C,$A82))","v":""},{"$f":"IF($A82=\"\",\"\",INDEX(Buchungen!D:D,$A82))","v":""},{"$f":"IF($A82=\"\",\"\",INDEX(Buchungen!E:E,$A82))","v":""},{"$f":"IF($A82=\"\",\"\",INDEX(Buchungen!F:F,$A82))","v":""}]
[{"$f":"IF(ROW()>COUNTIF(Buchungen!G:G,\"Sonstiges\"),\"\",A82+MATCH(\"Sonstiges\",INDIRECT(\"Buchungen!G\"&A82+1&\":G\"&65536-A82),0))","v":""},{"$f":"IF($A83=\"\",\"\",INDEX(Buchungen!A:A,$A83))","v":""},{"$f":"IF($A83=\"\",\"\",INDEX(Buchungen!B:B,$A83))","v":""},{"$f":"IF($A83=\"\",\"\",INDEX(Buchungen!C:C,$A83))","v":""},{"$f":"IF($A83=\"\",\"\",INDEX(Buchungen!D:D,$A83))","v":""},{"$f":"IF($A83=\"\",\"\",INDEX(Buchungen!E:E,$A83))","v":""},{"$f":"IF($A83=\"\",\"\",INDEX(Buchungen!F:F,$A83))","v":""}]
[{"$f":"IF(ROW()>COUNTIF(Buchungen!G:G,\"Sonstiges\"),\"\",A83+MATCH(\"Sonstiges\",INDIRECT(\"Buchungen!G\"&A83+1&\":G\"&65536-A83),0))","v":""},{"$f":"IF($A84=\"\",\"\",INDEX(Buchungen!A:A,$A84))","v":""},{"$f":"IF($A84=\"\",\"\",INDEX(Buchungen!B:B,$A84))","v":""},{"$f":"IF($A84=\"\",\"\",INDEX(Buchungen!C:C,$A84))","v":""},{"$f":"IF($A84=\"\",\"\",INDEX(Buchungen!D:D,$A84))","v":""},{"$f":"IF($A84=\"\",\"\",INDEX(Buchungen!E:E,$A84))","v":""},{"$f":"IF($A84=\"\",\"\",INDEX(Buchungen!F:F,$A84))","v":""}]
[{"$f":"IF(ROW()>COUNTIF(Buchungen!G:G,\"Sonstiges\"),\"\",A84+MATCH(\"Sonstiges\",INDIRECT(\"Buchungen!G\"&A84+1&\":G\"&65536-A84),0))","v":""},{"$f":"IF($A85=\"\",\"\",INDEX(Buchungen!A:A,$A85))","v":""},{"$f":"IF($A85=\"\",\"\",INDEX(Buchungen!B:B,$A85))","v":""},{"$f":"IF($A85=\"\",\"\",INDEX(Buchungen!C:C,$A85))","v":""},{"$f":"IF($A85=\"\",\"\",INDEX(Buchungen!D:D,$A85))","v":""},{"$f":"IF($A85=\"\",\"\",INDEX(Buchungen!E:E,$A85))","v":""},{"$f":"IF($A85=\"\",\"\",INDEX(Buchungen!F:F,$A85))","v":""}]
[{"$f":"IF(ROW()>COUNTIF(Buchungen!G:G,\"Sonstiges\"),\"\",A85+MATCH(\"Sonstiges\",INDIRECT(\"Buchungen!G\"&A85+1&\":G\"&65536-A85),0))","v":""},{"$f":"IF($A86=\"\",\"\",INDEX(Buchungen!A:A,$A86))","v":""},{"$f":"IF($A86=\"\",\"\",INDEX(Buchungen!B:B,$A86))","v":""},{"$f":"IF($A86=\"\",\"\",INDEX(Buchungen!C:C,$A86))","v":""},{"$f":"IF($A86=\"\",\"\",INDEX(Buchungen!D:D,$A86))","v":""},{"$f":"IF($A86=\"\",\"\",INDEX(Buchungen!E:E,$A86))","v":""},{"$f":"IF($A86=\"\",\"\",INDEX(Buchungen!F:F,$A86))","v":""}]
[{"$f":"IF(ROW()>COUNTIF(Buchungen!G:G,\"Sonstiges\"),\"\",A86+MATCH(\"Sonstiges\",INDIRECT(\"Buchungen!G\"&A86+1&\":G\"&65536-A86),0))","v":""},{"$f":"IF($A87=\"\",\"\",INDEX(Buchungen!A:A,$A87))","v":""},{"$f":"IF($A87=\"\",\"\",INDEX(Buchungen!B:B,$A87))","v":""},{"$f":"IF($A87=\"\",\"\",INDEX(Buchungen!C:C,$A87))","v":""},{"$f":"IF($A87=\"\",\"\",INDEX(Buchungen!D:D,$A87))","v":""},{"$f":"IF($A87=\"\",\"\",INDEX(Buchungen!E:E,$A87))","v":""},{"$f":"IF($A87=\"\",\"\",INDEX(Buchungen!F:F,$A87))","v":""}]
[{"$f":"IF(ROW()>COUNTIF(Buchungen!G:G,\"Sonstiges\"),\"\",A87+MATCH(\"Sonstiges\",INDIRECT(\"Buchungen!G\"&A87+1&\":G\"&65536-A87),0))","v":""},{"$f":"IF($A88=\"\",\"\",INDEX(Buchungen!A:A,$A88))","v":""},{"$f":"IF($A88=\"\",\"\",INDEX(Buchungen!B:B,$A88))","v":""},{"$f":"IF($A88=\"\",\"\",INDEX(Buchungen!C:C,$A88))","v":""},{"$f":"IF($A88=\"\",\"\",INDEX(Buchungen!D:D,$A88))","v":""},{"$f":"IF($A88=\"\",\"\",INDEX(Buchungen!E:E,$A88))","v":""},{"$f":"IF($A88=\"\",\"\",INDEX(Buchungen!F:F,$A88))","v":""}]
[{"$f":"IF(ROW()>COUNTIF(Buchungen!G:G,\"Sonstiges\"),\"\",A88+MATCH(\"Sonstiges\",INDIRECT(\"Buchungen!G\"&A88+1&\":G\"&65536-A88),0))","v":""},{"$f":"IF($A89=\"\",\"\",INDEX(Buchungen!A:A,$A89))","v":""},{"$f":"IF($A89=\"\",\"\",INDEX(Buchungen!B:B,$A89))","v":""},{"$f":"IF($A89=\"\",\"\",INDEX(Buchungen!C:C,$A89))","v":""},{"$f":"IF($A89=\"\",\"\",INDEX(Buchungen!D:D,$A89))","v":""},{"$f":"IF($A89=\"\",\"\",INDEX(Buchungen!E:E,$A89))","v":""},{"$f":"IF($A89=\"\",\"\",INDEX(Buchungen!F:F,$A89))","v":""}]
[{"$f":"IF(ROW()>COUNTIF(Buchungen!G:G,\"Sonstiges\"),\"\",A89+MATCH(\"Sonstiges\",INDIRECT(\"Buchungen!G\"&A89+1&\":G\"&65536-A89),0))","v":""},{"$f":"IF($A90=\"\",\"\",INDEX(Buchungen!A:A,$A90))","v":""},{"$f":"IF($A90=\"\",\"\",INDEX(Buchungen!B:B,$A90))","v":""},{"$f":"IF($A90=\"\",\"\",INDEX(Buchungen!C:C,$A90))","v":""},{"$f":"IF($A90=\"\",\"\",INDEX(Buchungen!D:D,$A90))","v":""},{"$f":"IF($A90=\"\",\"\",INDEX(Buchungen!E:E,$A90))","v":""},{"$f":"IF($A90=\"\",\"\",INDEX(Buchungen!F:F,$A90))","v":""}]
[{"$f":"IF(ROW()>COUNTIF(Buchungen!G:G,\"Sonstiges\"),\"\",A90+MATCH(\"Sonstiges\",INDIRECT(\"Buchungen!G\"&A90+1&\":G\"&65536-A90),0))","v":""},{"$f":"IF($A91=\"\",\"\",INDEX(Buchungen!A:A,$A91))","v":""},{"$f":"IF($A91=\"\",\"\",INDEX(Buchungen!B:B,$A91))","v":""},{"$f":"IF($A91=\"\",\"\",INDEX(Buchungen!C:C,$A91))","v":""},{"$f":"IF($A91=\"\",\"\",INDEX(Buchungen!D:D,$A91))","v":""},{"$f":"IF($A91=\"\",\"\",INDEX(Buchungen!E:E,$A91))","v":""},{"$f":"IF($A91=\"\",\"\",INDEX(Buchungen!F:F,$A91))","v":""}]
[{"$f":"IF(ROW()>COUNTIF(Buchungen!G:G,\"Sonstiges\"),\"\",A91+MATCH(\"Sonstiges\",INDIRECT(\"Buchungen!G\"&A91+1&\":G\"&65536-A91),0))","v":""}]
[{"$f":"IF(ROW()>COUNTIF(Buchungen!G:G,\"Sonstiges\"),\"\",A92+MATCH(\"Sonstiges\",INDIRECT(\"Buchungen!G\"&A92+1&\":G\"&65536-A92),0))","v":""}]
[{"$f":"IF(ROW()>COUNTIF(Buchungen!G:G,\"Sonstiges\"),\"\",A93+MATCH(\"Sonstiges\",INDIRECT(\"Buchungen!G\"&A93+1&\":G\"&65536-A93),0))","v":""}]
[{"$f":"IF(ROW()>COUNTIF(Buchungen!G:G,\"Sonstiges\"),\"\",A94+MATCH(\"Sonstiges\",INDIRECT(\"Buchungen!G\"&A94+1&\":G\"&65536-A94),0))","v":""}]
[{"$f":"IF(ROW()>COUNTIF(Buchungen!G:G,\"Sonstiges\"),\"\",A95+MATCH(\"Sonstiges\",INDIRECT(\"Buchungen!G\"&A95+1&\":G\"&65536-A95),0))","v":""}]
[{"$f":"IF(ROW()>COUNTIF(Buchungen!G:G,\"Sonstiges\"),\"\",A96+MATCH(\"Sonstiges\",INDIRECT(\"Buchungen!G\"&A96+1&\":G\"&65536-A96),0))","v":""}]
[{"$f":"IF(ROW()>COUNTIF(Buchungen!G:G,\"Sonstiges\"),\"\",A97+MATCH(\"Sonstiges\",INDIRECT(\"Buchungen!G\"&A97+1&\":G\"&65536-A97),0))","v":""}]
[{"$f":"IF(ROW()>COUNTIF(Buchungen!G:G,\"Sonstiges\"),\"\",A98+MATCH(\"Sonstiges\",INDIRECT(\"Buchungen!G\"&A98+1&\":G\"&65536-A98),0))","v":""}]
[{"$f":"IF(ROW()>COUNTIF(Buchungen!G:G,\"Sonstiges\"),\"\",A99+MATCH(\"Sonstiges\",INDIRECT(\"Buchungen!G\"&A99+1&\":G\"&65536-A99),0))","v":""}]
[{"$f":"IF(ROW()>COUNTIF(Buchungen!G:G,\"Sonstiges\"),\"\",A100+MATCH(\"Sonstiges\",INDIRECT(\"Buchungen!G\"&A100+1&\":G\"&65536-A100),0))","v":""}]
[{"$f":"IF(ROW()>COUNTIF(Buchungen!G:G,\"Sonstiges\"),\"\",A101+MATCH(\"Sonstiges\",INDIRECT(\"Buchungen!G\"&A101+1&\":G\"&65536-A101),0))","v":""}]
[{"$f":"IF(ROW()>COUNTIF(Buchungen!G:G,\"Sonstiges\"),\"\",A102+MATCH(\"Sonstiges\",INDIRECT(\"Buchungen!G\"&A102+1&\":G\"&65536-A102),0))","v":""}]
[{"$f":"IF(ROW()>COUNTIF(Buchungen!G:G,\"Sonstiges\"),\"\",A103+MATCH(\"Sonstiges\",INDIRECT(\"Buchungen!G\"&A103+1&\":G\"&65536-A103),0))","v":""}]
[{"$f":"IF(ROW()>COUNTIF(Buchungen!G:G,\"Sonstiges\"),\"\",A104+MATCH(\"Sonstiges\",INDIRECT(\"Buchungen!G\"&A104+1&\":G\"&65536-A104),0))","v":""}]
[{"$f":"IF(ROW()>COUNTIF(Buchungen!G:G,\"Sonstiges\"),\"\",A105+MATCH(\"Sonstiges\",INDIRECT(\"Buchungen!G\"&A105+1&\":G\"&65536-A105),0))","v":""}]
[{"$f":"IF(ROW()>COUNTIF(Buchungen!G:G,\"Sonstiges\"),\"\",A106+MATCH(\"Sonstiges\",INDIRECT(\"Buchungen!G\"&A106+1&\":G\"&65536-A106),0))","v":""}]
[{"$f":"IF(ROW()>COUNTIF(Buchungen!G:G,\"Sonstiges\"),\"\",A107+MATCH(\"Sonstiges\",INDIRECT(\"Buchungen!G\"&A107+1&\":G\"&65536-A107),0))","v":""}]
[{"$f":"IF(ROW()>COUNTIF(Buchungen!G:G,\"Sonstiges\"),\"\",A108+MATCH(\"Sonstiges\",INDIRECT(\"Buchungen!G\"&A108+1&\":G\"&65536-A108),0))","v":""}]
[{"$f":"IF(ROW()>COUNTIF(Buchungen!G:G,\"Sonstiges\"),\"\",A109+MATCH(\"Sonstiges\",INDIRECT(\"Buchungen!G\"&A109+1&\":G\"&65536-A109),0))","v":""}]
[{"$f":"IF(ROW()>COUNTIF(Buchungen!G:G,\"Sonstiges\"),\"\",A110+MATCH(\"Sonstiges\",INDIRECT(\"Buchungen!G\"&A110+1&\":G\"&65536-A110),0))","v":""}]
[{"$f":"IF(ROW()>COUNTIF(Buchungen!G:G,\"Sonstiges\"),\"\",A111+MATCH(\"Sonstiges\",INDIRECT(\"Buchungen!G\"&A111+1&\":G\"&65536-A111),0))","v":""}]
[{"$f":"IF(ROW()>COUNTIF(Buchungen!G:G,\"Sonstiges\"),\"\",A112+MATCH(\"Sonstiges\",INDIRECT(\"Buchungen!G\"&A112+1&\":G\"&65536-A112),0))","v":""}]
[{"$f":"IF(ROW()>COUNTIF(Buchungen!G:G,\"Sonstiges\"),\"\",A113+MATCH(\"Sonstiges\",INDIRECT(\"Buchungen!G\"&A113+1&\":G\"&65536-A113),0))","v":""}]
[{"$f":"IF(ROW()>COUNTIF(Buchungen!G:G,\"Sonstiges\"),\"\",A114+MATCH(\"Sonstiges\",INDIRECT(\"Buchungen!G\"&A114+1&\":G\"&65536-A114),0))","v":""}]
[{"$f":"IF(ROW()>COUNTIF(Buchungen!G:G,\"Sonstiges\"),\"\",A115+MATCH(\"Sonstiges\",INDIRECT(\"Buchungen!G\"&A115+1&\":G\"&65536-A115),0))","v":""}]
[{"$f":"IF(ROW()>COUNTIF(Buchungen!G:G,\"Sonstiges\"),\"\",A116+MATCH(\"Sonstiges\",INDIRECT(\"Buchungen!G\"&A116+1&\":G\"&65536-A116),0))","v":""}]
[{"$f":"IF(ROW()>COUNTIF(Buchungen!G:G,\"Sonstiges\"),\"\",A117+MATCH(\"Sonstiges\",INDIRECT(\"Buchungen!G\"&A117+1&\":G\"&65536-A117),0))","v":""}]
[{"$f":"IF(ROW()>COUNTIF(Buchungen!G:G,\"Sonstiges\"),\"\",A118+MATCH(\"Sonstiges\",INDIRECT(\"Buchungen!G\"&A118+1&\":G\"&65536-A118),0))","v":""}]
[{"$f":"IF(ROW()>COUNTIF(Buchungen!G:G,\"Sonstiges\"),\"\",A119+MATCH(\"Sonstiges\",INDIRECT(\"Buchungen!G\"&A119+1&\":G\"&65536-A119),0))","v":""}]
[{"$f":"IF(ROW()>COUNTIF(Buchungen!G:G,\"Sonstiges\"),\"\",A120+MATCH(\"Sonstiges\",INDIRECT(\"Buchungen!G\"&A120+1&\":G\"&65536-A120),0))","v":""}]
[{"$f":"IF(ROW()>COUNTIF(Buchungen!G:G,\"Sonstiges\"),\"\",A121+MATCH(\"Sonstiges\",INDIRECT(\"Buchungen!G\"&A121+1&\":G\"&65536-A121),0))","v":""}]
[{"$f":"IF(ROW()>COUNTIF(Buchungen!G:G,\"Sonstiges\"),\"\",A122+MATCH(\"Sonstiges\",INDIRECT(\"Buchungen!G\"&A122+1&\":G\"&65536-A122),0))","v":""}]
[{"$f":"IF(ROW()>COUNTIF(Buchungen!G:G,\"Sonstiges\"),\"\",A123+MATCH(\"Sonstiges\",INDIRECT(\"Buchungen!G\"&A123+1&\":G\"&65536-A123),0))","v":""}]
[{"$f":"IF(ROW()>COUNTIF(Buchungen!G:G,\"Sonstiges\"),\"\",A124+MATCH(\"Sonstiges\",INDIRECT(\"Buchungen!G\"&A124+1&\":G\"&65536-A124),0))","v":""}]
[{"$f":"IF(ROW()>COUNTIF(Buchungen!G:G,\"Sonstiges\"),\"\",A125+MATCH(\"Sonstiges\",INDIRECT(\"Buchungen!G\"&A125+1&\":G\"&65536-A125),0))","v":""}]
[{"$f":"IF(ROW()>COUNTIF(Buchungen!G:G,\"Sonstiges\"),\"\",A126+MATCH(\"Sonstiges\",INDIRECT(\"Buchungen!G\"&A126+1&\":G\"&65536-A126),0))","v":""}]
[{"$f":"IF(ROW()>COUNTIF(Buchungen!G:G,\"Sonstiges\"),\"\",A127+MATCH(\"Sonstiges\",INDIRECT(\"Buchungen!G\"&A127+1&\":G\"&65536-A127),0))","v":""}]
[{"$f":"IF(ROW()>COUNTIF(Buchungen!G:G,\"Sonstiges\"),\"\",A128+MATCH(\"Sonstiges\",INDIRECT(\"Buchungen!G\"&A128+1&\":G\"&65536-A128),0))","v":""}]
[{"$f":"IF(ROW()>COUNTIF(Buchungen!G:G,\"Sonstiges\"),\"\",A129+MATCH(\"Sonstiges\",INDIRECT(\"Buchungen!G\"&A129+1&\":G\"&65536-A129),0))","v":""}]
[{"$f":"IF(ROW()>COUNTIF(Buchungen!G:G,\"Sonstiges\"),\"\",A130+MATCH(\"Sonstiges\",INDIRECT(\"Buchungen!G\"&A130+1&\":G\"&65536-A130),0))","v":""}]
[{"$f":"IF(ROW()>COUNTIF(Buchungen!G:G,\"Sonstiges\"),\"\",A131+MATCH(\"Sonstiges\",INDIRECT(\"Buchungen!G\"&A131+1&\":G\"&65536-A131),0))","v":""}]
[{"$f":"IF(ROW()>COUNTIF(Buchungen!G:G,\"Sonstiges\"),\"\",A132+MATCH(\"Sonstiges\",INDIRECT(\"Buchungen!G\"&A132+1&\":G\"&65536-A132),0))","v":""}]
[{"$f":"IF(ROW()>COUNTIF(Buchungen!G:G,\"Sonstiges\"),\"\",A133+MATCH(\"Sonstiges\",INDIRECT(\"Buchungen!G\"&A133+1&\":G\"&65536-A133),0))","v":""}]
[{"$f":"IF(ROW()>COUNTIF(Buchungen!G:G,\"Sonstiges\"),\"\",A134+MATCH(\"Sonstiges\",INDIRECT(\"Buchungen!G\"&A134+1&\":G\"&65536-A134),0))","v":""}]
[{"$f":"IF(ROW()>COUNTIF(Buchungen!G:G,\"Sonstiges\"),\"\",A135+MATCH(\"Sonstiges\",INDIRECT(\"Buchungen!G\"&A135+1&\":G\"&65536-A135),0))","v":""}]
[{"$f":"IF(ROW()>COUNTIF(Buchungen!G:G,\"Sonstiges\"),\"\",A136+MATCH(\"Sonstiges\",INDIRECT(\"Buchungen!G\"&A136+1&\":G\"&65536-A136),0))","v":""}]
[{"$f":"IF(ROW()>COUNTIF(Buchungen!G:G,\"Sonstiges\"),\"\",A137+MATCH(\"Sonstiges\",INDIRECT(\"Buchungen!G\"&A137+1&\":G\"&65536-A137),0))","v":""}]
[{"$f":"IF(ROW()>COUNTIF(Buchungen!G:G,\"Sonstiges\"),\"\",A138+MATCH(\"Sonstiges\",INDIRECT(\"Buchungen!G\"&A138+1&\":G\"&65536-A138),0))","v":""}]
[{"$f":"IF(ROW()>COUNTIF(Buchungen!G:G,\"Sonstiges\"),\"\",A139+MATCH(\"Sonstiges\",INDIRECT(\"Buchungen!G\"&A139+1&\":G\"&65536-A139),0))","v":""}]
[{"$f":"IF(ROW()>COUNTIF(Buchungen!G:G,\"Sonstiges\"),\"\",A140+MATCH(\"Sonstiges\",INDIRECT(\"Buchungen!G\"&A140+1&\":G\"&65536-A140),0))","v":""}]
[{"$f":"IF(ROW()>COUNTIF(Buchungen!G:G,\"Sonstiges\"),\"\",A141+MATCH(\"Sonstiges\",INDIRECT(\"Buchungen!G\"&A141+1&\":G\"&65536-A141),0))","v":""}]
[{"$f":"IF(ROW()>COUNTIF(Buchungen!G:G,\"Sonstiges\"),\"\",A142+MATCH(\"Sonstiges\",INDIRECT(\"Buchungen!G\"&A142+1&\":G\"&65536-A142),0))","v":""}]
[{"$f":"IF(ROW()>COUNTIF(Buchungen!G:G,\"Sonstiges\"),\"\",A143+MATCH(\"Sonstiges\",INDIRECT(\"Buchungen!G\"&A143+1&\":G\"&65536-A143),0))","v":""}]
[{"$f":"IF(ROW()>COUNTIF(Buchungen!G:G,\"Sonstiges\"),\"\",A144+MATCH(\"Sonstiges\",INDIRECT(\"Buchungen!G\"&A144+1&\":G\"&65536-A144),0))","v":""}]
[{"$f":"IF(ROW()>COUNTIF(Buchungen!G:G,\"Sonstiges\"),\"\",A145+MATCH(\"Sonstiges\",INDIRECT(\"Buchungen!G\"&A145+1&\":G\"&65536-A145),0))","v":""}]
[{"$f":"IF(ROW()>COUNTIF(Buchungen!G:G,\"Sonstiges\"),\"\",A146+MATCH(\"Sonstiges\",INDIRECT(\"Buchungen!G\"&A146+1&\":G\"&65536-A146),0))","v":""}]
[{"$f":"IF(ROW()>COUNTIF(Buchungen!G:G,\"Sonstiges\"),\"\",A147+MATCH(\"Sonstiges\",INDIRECT(\"Buchungen!G\"&A147+1&\":G\"&65536-A147),0))","v":""}]
[{"$f":"IF(ROW()>COUNTIF(Buchungen!G:G,\"Sonstiges\"),\"\",A148+MATCH(\"Sonstiges\",INDIRECT(\"Buchungen!G\"&A148+1&\":G\"&65536-A148),0))","v":""}]
[{"$f":"IF(ROW()>COUNTIF(Buchungen!G:G,\"Sonstiges\"),\"\",A149+MATCH(\"Sonstiges\",INDIRECT(\"Buchungen!G\"&A149+1&\":G\"&65536-A149),0))","v":""}]
[{"$f":"IF(ROW()>COUNTIF(Buchungen!G:G,\"Sonstiges\"),\"\",A150+MATCH(\"Sonstiges\",INDIRECT(\"Buchungen!G\"&A150+1&\":G\"&65536-A150),0))","v":""}]
[{"$f":"IF(ROW()>COUNTIF(Buchungen!G:G,\"Sonstiges\"),\"\",A151+MATCH(\"Sonstiges\",INDIRECT(\"Buchungen!G\"&A151+1&\":G\"&65536-A151),0))","v":""}]
[{"$f":"IF(ROW()>COUNTIF(Buchungen!G:G,\"Sonstiges\"),\"\",A152+MATCH(\"Sonstiges\",INDIRECT(\"Buchungen!G\"&A152+1&\":G\"&65536-A152),0))","v":""}]
[{"$f":"IF(ROW()>COUNTIF(Buchungen!G:G,\"Sonstiges\"),\"\",A153+MATCH(\"Sonstiges\",INDIRECT(\"Buchungen!G\"&A153+1&\":G\"&65536-A153),0))","v":""}]
[{"$f":"IF(ROW()>COUNTIF(Buchungen!G:G,\"Sonstiges\"),\"\",A154+MATCH(\"Sonstiges\",INDIRECT(\"Buchungen!G\"&A154+1&\":G\"&65536-A154),0))","v":""}]
[{"$f":"IF(ROW()>COUNTIF(Buchungen!G:G,\"Sonstiges\"),\"\",A155+MATCH(\"Sonstiges\",INDIRECT(\"Buchungen!G\"&A155+1&\":G\"&65536-A155),0))","v":""}]
[{"$f":"IF(ROW()>COUNTIF(Buchungen!G:G,\"Sonstiges\"),\"\",A156+MATCH(\"Sonstiges\",INDIRECT(\"Buchungen!G\"&A156+1&\":G\"&65536-A156),0))","v":""}]
[{"$f":"IF(ROW()>COUNTIF(Buchungen!G:G,\"Sonstiges\"),\"\",A157+MATCH(\"Sonstiges\",INDIRECT(\"Buchungen!G\"&A157+1&\":G\"&65536-A157),0))","v":""}]
[{"$f":"IF(ROW()>COUNTIF(Buchungen!G:G,\"Sonstiges\"),\"\",A158+MATCH(\"Sonstiges\",INDIRECT(\"Buchungen!G\"&A158+1&\":G\"&65536-A158),0))","v":""}]
[{"$f":"IF(ROW()>COUNTIF(Buchungen!G:G,\"Sonstiges\"),\"\",A159+MATCH(\"Sonstiges\",INDIRECT(\"Buchungen!G\"&A159+1&\":G\"&65536-A159),0))","v":""}]
[{"$f":"IF(ROW()>COUNTIF(Buchungen!G:G,\"Sonstiges\"),\"\",A160+MATCH(\"Sonstiges\",INDIRECT(\"Buchungen!G\"&A160+1&\":G\"&65536-A160),0))","v":""}]
[{"$f":"IF(ROW()>COUNTIF(Buchungen!G:G,\"Sonstiges\"),\"\",A161+MATCH(\"Sonstiges\",INDIRECT(\"Buchungen!G\"&A161+1&\":G\"&65536-A161),0))","v":""}]
[{"$f":"IF(ROW()>COUNTIF(Buchungen!G:G,\"Sonstiges\"),\"\",A162+MATCH(\"Sonstiges\",INDIRECT(\"Buchungen!G\"&A162+1&\":G\"&65536-A162),0))","v":""}]
[{"$f":"IF(ROW()>COUNTIF(Buchungen!G:G,\"Sonstiges\"),\"\",A163+MATCH(\"Sonstiges\",INDIRECT(\"Buchungen!G\"&A163+1&\":G\"&65536-A163),0))","v":""}]
[{"$f":"IF(ROW()>COUNTIF(Buchungen!G:G,\"Sonstiges\"),\"\",A164+MATCH(\"Sonstiges\",INDIRECT(\"Buchungen!G\"&A164+1&\":G\"&65536-A164),0))","v":""}]
[{"$f":"IF(ROW()>COUNTIF(Buchungen!G:G,\"Sonstiges\"),\"\",A165+MATCH(\"Sonstiges\",INDIRECT(\"Buchungen!G\"&A165+1&\":G\"&65536-A165),0))","v":""}]
[{"$f":"IF(ROW()>COUNTIF(Buchungen!G:G,\"Sonstiges\"),\"\",A166+MATCH(\"Sonstiges\",INDIRECT(\"Buchungen!G\"&A166+1&\":G\"&65536-A166),0))","v":""}]
[{"$f":"IF(ROW()>COUNTIF(Buchungen!G:G,\"Sonstiges\"),\"\",A167+MATCH(\"Sonstiges\",INDIRECT(\"Buchungen!G\"&A167+1&\":G\"&65536-A167),0))","v":""}]
[{"$f":"IF(ROW()>COUNTIF(Buchungen!G:G,\"Sonstiges\"),\"\",A168+MATCH(\"Sonstiges\",INDIRECT(\"Buchungen!G\"&A168+1&\":G\"&65536-A168),0))","v":""}]
[{"$f":"IF(ROW()>COUNTIF(Buchungen!G:G,\"Sonstiges\"),\"\",A169+MATCH(\"Sonstiges\",INDIRECT(\"Buchungen!G\"&A169+1&\":G\"&65536-A169),0))","v":""}]
[{"$f":"IF(ROW()>COUNTIF(Buchungen!G:G,\"Sonstiges\"),\"\",A170+MATCH(\"Sonstiges\",INDIRECT(\"Buchungen!G\"&A170+1&\":G\"&65536-A170),0))","v":""}]
[{"$f":"IF(ROW()>COUNTIF(Buchungen!G:G,\"Sonstiges\"),\"\",A171+MATCH(\"Sonstiges\",INDIRECT(\"Buchungen!G\"&A171+1&\":G\"&65536-A171),0))","v":""}]
[{"$f":"IF(ROW()>COUNTIF(Buchungen!G:G,\"Sonstiges\"),\"\",A172+MATCH(\"Sonstiges\",INDIRECT(\"Buchungen!G\"&A172+1&\":G\"&65536-A172),0))","v":""}]
[{"$f":"IF(ROW()>COUNTIF(Buchungen!G:G,\"Sonstiges\"),\"\",A173+MATCH(\"Sonstiges\",INDIRECT(\"Buchungen!G\"&A173+1&\":G\"&65536-A173),0))","v":""}]
[{"$f":"IF(ROW()>COUNTIF(Buchungen!G:G,\"Sonstiges\"),\"\",A174+MATCH(\"Sonstiges\",INDIRECT(\"Buchungen!G\"&A174+1&\":G\"&65536-A174),0))","v":""}]
[{"$f":"IF(ROW()>COUNTIF(Buchungen!G:G,\"Sonstiges\"),\"\",A175+MATCH(\"Sonstiges\",INDIRECT(\"Buchungen!G\"&A175+1&\":G\"&65536-A175),0))","v":""}]
[{"$f":"IF(ROW()>COUNTIF(Buchungen!G:G,\"Sonstiges\"),\"\",A176+MATCH(\"Sonstiges\",INDIRECT(\"Buchungen!G\"&A176+1&\":G\"&65536-A176),0))","v":""}]
[{"$f":"IF(ROW()>COUNTIF(Buchungen!G:G,\"Sonstiges\"),\"\",A177+MATCH(\"Sonstiges\",INDIRECT(\"Buchungen!G\"&A177+1&\":G\"&65536-A177),0))","v":""}]
[{"$f":"IF(ROW()>COUNTIF(Buchungen!G:G,\"Sonstiges\"),\"\",A178+MATCH(\"Sonstiges\",INDIRECT(\"Buchungen!G\"&A178+1&\":G\"&65536-A178),0))","v":""}]
[{"$f":"IF(ROW()>COUNTIF(Buchungen!G:G,\"Sonstiges\"),\"\",A179+MATCH(\"Sonstiges\",INDIRECT(\"Buchungen!G\"&A179+1&\":G\"&65536-A179),0))","v":""}]
[{"$f":"IF(ROW()>COUNTIF(Buchungen!G:G,\"Sonstiges\"),\"\",A180+MATCH(\"Sonstiges\",INDIRECT(\"Buchungen!G\"&A180+1&\":G\"&65536-A180),0))","v":""}]
[{"$f":"IF(ROW()>COUNTIF(Buchungen!G:G,\"Sonstiges\"),\"\",A181+MATCH(\"Sonstiges\",INDIRECT(\"Buchungen!G\"&A181+1&\":G\"&65536-A181),0))","v":""}]
[{"$f":"IF(ROW()>COUNTIF(Buchungen!G:G,\"Sonstiges\"),\"\",A182+MATCH(\"Sonstiges\",INDIRECT(\"Buchungen!G\"&A182+1&\":G\"&65536-A182),0))","v":""}]
[{"$f":"IF(ROW()>COUNTIF(Buchungen!G:G,\"Sonstiges\"),\"\",A183+MATCH(\"Sonstiges\",INDIRECT(\"Buchungen!G\"&A183+1&\":G\"&65536-A183),0))","v":""}]
[{"$f":"IF(ROW()>COUNTIF(Buchungen!G:G,\"Sonstiges\"),\"\",A184+MATCH(\"Sonstiges\",INDIRECT(\"Buchungen!G\"&A184+1&\":G\"&65536-A184),0))","v":""}]
[{"$f":"IF(ROW()>COUNTIF(Buchungen!G:G,\"Sonstiges\"),\"\",A185+MATCH(\"Sonstiges\",INDIRECT(\"Buchungen!G\"&A185+1&\":G\"&65536-A185),0))","v":""}]
[{"$f":"IF(ROW()>COUNTIF(Buchungen!G:G,\"Sonstiges\"),\"\",A186+MATCH(\"Sonstiges\",INDIRECT(\"Buchungen!G\"&A186+1&\":G\"&65536-A186),0))","v":""}]
[{"$f":"IF(ROW()>COUNTIF(Buchungen!G:G,\"Sonstiges\"),\"\",A187+MATCH(\"Sonstiges\",INDIRECT(\"Buchungen!G\"&A187+1&\":G\"&65536-A187),0))","v":""}]
[{"$f":"IF(ROW()>COUNTIF(Buchungen!G:G,\"Sonstiges\"),\"\",A188+MATCH(\"Sonstiges\",INDIRECT(\"Buchungen!G\"&A188+1&\":G\"&65536-A188),0))","v":""}]
[{"$f":"IF(ROW()>COUNTIF(Buchungen!G:G,\"Sonstiges\"),\"\",A189+MATCH(\"Sonstiges\",INDIRECT(\"Buchungen!G\"&A189+1&\":G\"&65536-A189),0))","v":""}]
[{"$f":"IF(ROW()>COUNTIF(Buchungen!G:G,\"Sonstiges\"),\"\",A190+MATCH(\"Sonstiges\",INDIRECT(\"Buchungen!G\"&A190+1&\":G\"&65536-A190),0))","v":""}]
[{"$f":"IF(ROW()>COUNTIF(Buchungen!G:G,\"Sonstiges\"),\"\",A191+MATCH(\"Sonstiges\",INDIRECT(\"Buchungen!G\"&A191+1&\":G\"&65536-A191),0))","v":""}]
[{"$f":"IF(ROW()>COUNTIF(Buchungen!G:G,\"Sonstiges\"),\"\",A192+MATCH(\"Sonstiges\",INDIRECT(\"Buchungen!G\"&A192+1&\":G\"&65536-A192),0))","v":""}]
[{"$f":"IF(ROW()>COUNTIF(Buchungen!G:G,\"Sonstiges\"),\"\",A193+MATCH(\"Sonstiges\",INDIRECT(\"Buchungen!G\"&A193+1&\":G\"&65536-A193),0))","v":""}]
[{"$f":"IF(ROW()>COUNTIF(Buchungen!G:G,\"Sonstiges\"),\"\",A194+MATCH(\"Sonstiges\",INDIRECT(\"Buchungen!G\"&A194+1&\":G\"&65536-A194),0))","v":""}]
[{"$f":"IF(ROW()>COUNTIF(Buchungen!G:G,\"Sonstiges\"),\"\",A195+MATCH(\"Sonstiges\",INDIRECT(\"Buchungen!G\"&A195+1&\":G\"&65536-A195),0))","v":""}]
[{"$f":"IF(ROW()>COUNTIF(Buchungen!G:G,\"Sonstiges\"),\"\",A196+MATCH(\"Sonstiges\",INDIRECT(\"Buchungen!G\"&A196+1&\":G\"&65536-A196),0))","v":""}]
[{"$f":"IF(ROW()>COUNTIF(Buchungen!G:G,\"Sonstiges\"),\"\",A197+MATCH(\"Sonstiges\",INDIRECT(\"Buchungen!G\"&A197+1&\":G\"&65536-A197),0))","v":""}]
[{"$f":"IF(ROW()>COUNTIF(Buchungen!G:G,\"Sonstiges\"),\"\",A198+MATCH(\"Sonstiges\",INDIRECT(\"Buchungen!G\"&A198+1&\":G\"&65536-A198),0))","v":""}]
[{"$f":"IF(ROW()>COUNTIF(Buchungen!G:G,\"Sonstiges\"),\"\",A199+MATCH(\"Sonstiges\",INDIRECT(\"Buchungen!G\"&A199+1&\":G\"&65536-A199),0))","v":""}]
[{"$f":"IF(ROW()>COUNTIF(Buchungen!G:G,\"Sonstiges\"),\"\",A200+MATCH(\"Sonstiges\",INDIRECT(\"Buchungen!G\"&A200+1&\":G\"&65536-A200),0))","v":""}]
[{"$f":"IF(ROW()>COUNTIF(Buchungen!G:G,\"Sonstiges\"),\"\",A201+MATCH(\"Sonstiges\",INDIRECT(\"Buchungen!G\"&A201+1&\":G\"&65536-A201),0))","v":""}]
[{"$f":"IF(ROW()>COUNTIF(Buchungen!G:G,\"Sonstiges\"),\"\",A202+MATCH(\"Sonstiges\",INDIRECT(\"Buchungen!G\"&A202+1&\":G\"&65536-A202),0))","v":""}]
[{"$f":"IF(ROW()>COUNTIF(Buchungen!G:G,\"Sonstiges\"),\"\",A203+MATCH(\"Sonstiges\",INDIRECT(\"Buchungen!G\"&A203+1&\":G\"&65536-A203),0))","v":""}]
[{"$f":"IF(ROW()>COUNTIF(Buchungen!G:G,\"Sonstiges\"),\"\",A204+MATCH(\"Sonstiges\",INDIRECT(\"Buchungen!G\"&A204+1&\":G\"&65536-A204),0))","v":""}]
[{"$f":"IF(ROW()>COUNTIF(Buchungen!G:G,\"Sonstiges\"),\"\",A205+MATCH(\"Sonstiges\",INDIRECT(\"Buchungen!G\"&A205+1&\":G\"&65536-A205),0))","v":""}]
[{"$f":"IF(ROW()>COUNTIF(Buchungen!G:G,\"Sonstiges\"),\"\",A206+MATCH(\"Sonstiges\",INDIRECT(\"Buchungen!G\"&A206+1&\":G\"&65536-A206),0))","v":""}]
[{"$f":"IF(ROW()>COUNTIF(Buchungen!G:G,\"Sonstiges\"),\"\",A207+MATCH(\"Sonstiges\",INDIRECT(\"Buchungen!G\"&A207+1&\":G\"&65536-A207),0))","v":""}]
[{"$f":"IF(ROW()>COUNTIF(Buchungen!G:G,\"Sonstiges\"),\"\",A208+MATCH(\"Sonstiges\",INDIRECT(\"Buchungen!G\"&A208+1&\":G\"&65536-A208),0))","v":""}]
[{"$f":"IF(ROW()>COUNTIF(Buchungen!G:G,\"Sonstiges\"),\"\",A209+MATCH(\"Sonstiges\",INDIRECT(\"Buchungen!G\"&A209+1&\":G\"&65536-A209),0))","v":""}]
[{"$f":"IF(ROW()>COUNTIF(Buchungen!G:G,\"Sonstiges\"),\"\",A210+MATCH(\"Sonstiges\",INDIRECT(\"Buchungen!G\"&A210+1&\":G\"&65536-A210),0))","v":""}]
[{"$f":"IF(ROW()>COUNTIF(Buchungen!G:G,\"Sonstiges\"),\"\",A211+MATCH(\"Sonstiges\",INDIRECT(\"Buchungen!G\"&A211+1&\":G\"&65536-A211),0))","v":""}]
[{"$f":"IF(ROW()>COUNTIF(Buchungen!G:G,\"Sonstiges\"),\"\",A212+MATCH(\"Sonstiges\",INDIRECT(\"Buchungen!G\"&A212+1&\":G\"&65536-A212),0))","v":""}]
[{"$f":"IF(ROW()>COUNTIF(Buchungen!G:G,\"Sonstiges\"),\"\",A213+MATCH(\"Sonstiges\",INDIRECT(\"Buchungen!G\"&A213+1&\":G\"&65536-A213),0))","v":""}]
[{"$f":"IF(ROW()>COUNTIF(Buchungen!G:G,\"Sonstiges\"),\"\",A214+MATCH(\"Sonstiges\",INDIRECT(\"Buchungen!G\"&A214+1&\":G\"&65536-A214),0))","v":""}]
[{"$f":"IF(ROW()>COUNTIF(Buchungen!G:G,\"Sonstiges\"),\"\",A215+MATCH(\"Sonstiges\",INDIRECT(\"Buchungen!G\"&A215+1&\":G\"&65536-A215),0))","v":""}]
[{"$f":"IF(ROW()>COUNTIF(Buchungen!G:G,\"Sonstiges\"),\"\",A216+MATCH(\"Sonstiges\",INDIRECT(\"Buchungen!G\"&A216+1&\":G\"&65536-A216),0))","v":""}]
[{"$f":"IF(ROW()>COUNTIF(Buchungen!G:G,\"Sonstiges\"),\"\",A217+MATCH(\"Sonstiges\",INDIRECT(\"Buchungen!G\"&A217+1&\":G\"&65536-A217),0))","v":""}]
[{"$f":"IF(ROW()>COUNTIF(Buchungen!G:G,\"Sonstiges\"),\"\",A218+MATCH(\"Sonstiges\",INDIRECT(\"Buchungen!G\"&A218+1&\":G\"&65536-A218),0))","v":""}]
[{"$f":"IF(ROW()>COUNTIF(Buchungen!G:G,\"Sonstiges\"),\"\",A219+MATCH(\"Sonstiges\",INDIRECT(\"Buchungen!G\"&A219+1&\":G\"&65536-A219),0))","v":""}]
[{"$f":"IF(ROW()>COUNTIF(Buchungen!G:G,\"Sonstiges\"),\"\",A220+MATCH(\"Sonstiges\",INDIRECT(\"Buchungen!G\"&A220+1&\":G\"&65536-A220),0))","v":""}]
[{"$f":"IF(ROW()>COUNTIF(Buchungen!G:G,\"Sonstiges\"),\"\",A221+MATCH(\"Sonstiges\",INDIRECT(\"Buchungen!G\"&A221+1&\":G\"&65536-A221),0))","v":""}]
[{"$f":"IF(ROW()>COUNTIF(Buchungen!G:G,\"Sonstiges\"),\"\",A222+MATCH(\"Sonstiges\",INDIRECT(\"Buchungen!G\"&A222+1&\":G\"&65536-A222),0))","v":""}]
[{"$f":"IF(ROW()>COUNTIF(Buchungen!G:G,\"Sonstiges\"),\"\",A223+MATCH(\"Sonstiges\",INDIRECT(\"Buchungen!G\"&A223+1&\":G\"&65536-A223),0))","v":""}]
[{"$f":"IF(ROW()>COUNTIF(Buchungen!G:G,\"Sonstiges\"),\"\",A224+MATCH(\"Sonstiges\",INDIRECT(\"Buchungen!G\"&A224+1&\":G\"&65536-A224),0))","v":""}]
[{"$f":"IF(ROW()>COUNTIF(Buchungen!G:G,\"Sonstiges\"),\"\",A225+MATCH(\"Sonstiges\",INDIRECT(\"Buchungen!G\"&A225+1&\":G\"&65536-A225),0))","v":""}]
[{"$f":"IF(ROW()>COUNTIF(Buchungen!G:G,\"Sonstiges\"),\"\",A226+MATCH(\"Sonstiges\",INDIRECT(\"Buchungen!G\"&A226+1&\":G\"&65536-A226),0))","v":""}]
[{"$f":"IF(ROW()>COUNTIF(Buchungen!G:G,\"Sonstiges\"),\"\",A227+MATCH(\"Sonstiges\",INDIRECT(\"Buchungen!G\"&A227+1&\":G\"&65536-A227),0))","v":""}]
[{"$f":"IF(ROW()>COUNTIF(Buchungen!G:G,\"Sonstiges\"),\"\",A228+MATCH(\"Sonstiges\",INDIRECT(\"Buchungen!G\"&A228+1&\":G\"&65536-A228),0))","v":""}]
[{"$f":"IF(ROW()>COUNTIF(Buchungen!G:G,\"Sonstiges\"),\"\",A229+MATCH(\"Sonstiges\",INDIRECT(\"Buchungen!G\"&A229+1&\":G\"&65536-A229),0))","v":""}]
[{"$f":"IF(ROW()>COUNTIF(Buchungen!G:G,\"Sonstiges\"),\"\",A230+MATCH(\"Sonstiges\",INDIRECT(\"Buchungen!G\"&A230+1&\":G\"&65536-A230),0))","v":""}]
[{"$f":"IF(ROW()>COUNTIF(Buchungen!G:G,\"Sonstiges\"),\"\",A231+MATCH(\"Sonstiges\",INDIRECT(\"Buchungen!G\"&A231+1&\":G\"&65536-A231),0))","v":""}]
[{"$f":"IF(ROW()>COUNTIF(Buchungen!G:G,\"Sonstiges\"),\"\",A232+MATCH(\"Sonstiges\",INDIRECT(\"Buchungen!G\"&A232+1&\":G\"&65536-A232),0))","v":""}]
[{"$f":"IF(ROW()>COUNTIF(Buchungen!G:G,\"Sonstiges\"),\"\",A233+MATCH(\"Sonstiges\",INDIRECT(\"Buchungen!G\"&A233+1&\":G\"&65536-A233),0))","v":""}]
[{"$f":"IF(ROW()>COUNTIF(Buchungen!G:G,\"Sonstiges\"),\"\",A234+MATCH(\"Sonstiges\",INDIRECT(\"Buchungen!G\"&A234+1&\":G\"&65536-A234),0))","v":""}]
[{"$f":"IF(ROW()>COUNTIF(Buchungen!G:G,\"Sonstiges\"),\"\",A235+MATCH(\"Sonstiges\",INDIRECT(\"Buchungen!G\"&A235+1&\":G\"&65536-A235),0))","v":""}]
[{"$f":"IF(ROW()>COUNTIF(Buchungen!G:G,\"Sonstiges\"),\"\",A236+MATCH(\"Sonstiges\",INDIRECT(\"Buchungen!G\"&A236+1&\":G\"&65536-A236),0))","v":""}]
[{"$f":"IF(ROW()>COUNTIF(Buchungen!G:G,\"Sonstiges\"),\"\",A237+MATCH(\"Sonstiges\",INDIRECT(\"Buchungen!G\"&A237+1&\":G\"&65536-A237),0))","v":""}]
[{"$f":"IF(ROW()>COUNTIF(Buchungen!G:G,\"Sonstiges\"),\"\",A238+MATCH(\"Sonstiges\",INDIRECT(\"Buchungen!G\"&A238+1&\":G\"&65536-A238),0))","v":""}]
[{"$f":"IF(ROW()>COUNTIF(Buchungen!G:G,\"Sonstiges\"),\"\",A239+MATCH(\"Sonstiges\",INDIRECT(\"Buchungen!G\"&A239+1&\":G\"&65536-A239),0))","v":""}]
[{"$f":"IF(ROW()>COUNTIF(Buchungen!G:G,\"Sonstiges\"),\"\",A240+MATCH(\"Sonstiges\",INDIRECT(\"Buchungen!G\"&A240+1&\":G\"&65536-A240),0))","v":""}]
[{"$f":"IF(ROW()>COUNTIF(Buchungen!G:G,\"Sonstiges\"),\"\",A241+MATCH(\"Sonstiges\",INDIRECT(\"Buchungen!G\"&A241+1&\":G\"&65536-A241),0))","v":""}]
[{"$f":"IF(ROW()>COUNTIF(Buchungen!G:G,\"Sonstiges\"),\"\",A242+MATCH(\"Sonstiges\",INDIRECT(\"Buchungen!G\"&A242+1&\":G\"&65536-A242),0))","v":""}]
[{"$f":"IF(ROW()>COUNTIF(Buchungen!G:G,\"Sonstiges\"),\"\",A243+MATCH(\"Sonstiges\",INDIRECT(\"Buchungen!G\"&A243+1&\":G\"&65536-A243),0))","v":""}]
[{"$f":"IF(ROW()>COUNTIF(Buchungen!G:G,\"Sonstiges\"),\"\",A244+MATCH(\"Sonstiges\",INDIRECT(\"Buchungen!G\"&A244+1&\":G\"&65536-A244),0))","v":""}]
[{"$f":"IF(ROW()>COUNTIF(Buchungen!G:G,\"Sonstiges\"),\"\",A245+MATCH(\"Sonstiges\",INDIRECT(\"Buchungen!G\"&A245+1&\":G\"&65536-A245),0))","v":""}]
[{"$f":"IF(ROW()>COUNTIF(Buchungen!G:G,\"Sonstiges\"),\"\",A246+MATCH(\"Sonstiges\",INDIRECT(\"Buchungen!G\"&A246+1&\":G\"&65536-A246),0))","v":""}]
[{"$f":"IF(ROW()>COUNTIF(Buchungen!G:G,\"Sonstiges\"),\"\",A247+MATCH(\"Sonstiges\",INDIRECT(\"Buchungen!G\"&A247+1&\":G\"&65536-A247),0))","v":""}]
[{"$f":"IF(ROW()>COUNTIF(Buchungen!G:G,\"Sonstiges\"),\"\",A248+MATCH(\"Sonstiges\",INDIRECT(\"Buchungen!G\"&A248+1&\":G\"&65536-A248),0))","v":""}]
[{"$f":"IF(ROW()>COUNTIF(Buchungen!G:G,\"Sonstiges\"),\"\",A249+MATCH(\"Sonstiges\",INDIRECT(\"Buchungen!G\"&A249+1&\":G\"&65536-A249),0))","v":""}]
[{"$f":"IF(ROW()>COUNTIF(Buchungen!G:G,\"Sonstiges\"),\"\",A250+MATCH(\"Sonstiges\",INDIRECT(\"Buchungen!G\"&A250+1&\":G\"&65536-A250),0))","v":""}]
[{"$f":"IF(ROW()>COUNTIF(Buchungen!G:G,\"Sonstiges\"),\"\",A251+MATCH(\"Sonstiges\",INDIRECT(\"Buchungen!G\"&A251+1&\":G\"&65536-A251),0))","v":""}]
[{"$f":"IF(ROW()>COUNTIF(Buchungen!G:G,\"Sonstiges\"),\"\",A252+MATCH(\"Sonstiges\",INDIRECT(\"Buchungen!G\"&A252+1&\":G\"&65536-A252),0))","v":""}]
[{"$f":"IF(ROW()>COUNTIF(Buchungen!G:G,\"Sonstiges\"),\"\",A253+MATCH(\"Sonstiges\",INDIRECT(\"Buchungen!G\"&A253+1&\":G\"&65536-A253),0))","v":""}]
[{"$f":"IF(ROW()>COUNTIF(Buchungen!G:G,\"Sonstiges\"),\"\",A254+MATCH(\"Sonstiges\",INDIRECT(\"Buchungen!G\"&A254+1&\":G\"&65536-A254),0))","v":""}]
[{"$f":"IF(ROW()>COUNTIF(Buchungen!G:G,\"Sonstiges\"),\"\",A255+MATCH(\"Sonstiges\",INDIRECT(\"Buchungen!G\"&A255+1&\":G\"&65536-A255),0))","v":""}]
[{"$f":"IF(ROW()>COUNTIF(Buchungen!G:G,\"Sonstiges\"),\"\",A256+MATCH(\"Sonstiges\",INDIRECT(\"Buchungen!G\"&A256+1&\":G\"&65536-A256),0))","v":""}]
[{"$f":"IF(ROW()>COUNTIF(Buchungen!G:G,\"Sonstiges\"),\"\",A257+MATCH(\"Sonstiges\",INDIRECT(\"Buchungen!G\"&A257+1&\":G\"&65536-A257),0))","v":""}]
[{"$f":"IF(ROW()>COUNTIF(Buchungen!G:G,\"Sonstiges\"),\"\",A258+MATCH(\"Sonstiges\",INDIRECT(\"Buchungen!G\"&A258+1&\":G\"&65536-A258),0))","v":""}]
[{"$f":"IF(ROW()>COUNTIF(Buchungen!G:G,\"Sonstiges\"),\"\",A259+MATCH(\"Sonstiges\",INDIRECT(\"Buchungen!G\"&A259+1&\":G\"&65536-A259),0))","v":""}]
[{"$f":"IF(ROW()>COUNTIF(Buchungen!G:G,\"Sonstiges\"),\"\",A260+MATCH(\"Sonstiges\",INDIRECT(\"Buchungen!G\"&A260+1&\":G\"&65536-A260),0))","v":""}]
[{"$f":"IF(ROW()>COUNTIF(Buchungen!G:G,\"Sonstiges\"),\"\",A261+MATCH(\"Sonstiges\",INDIRECT(\"Buchungen!G\"&A261+1&\":G\"&65536-A261),0))","v":""}]
[{"$f":"IF(ROW()>COUNTIF(Buchungen!G:G,\"Sonstiges\"),\"\",A262+MATCH(\"Sonstiges\",INDIRECT(\"Buchungen!G\"&A262+1&\":G\"&65536-A262),0))","v":""}]
[{"$f":"IF(ROW()>COUNTIF(Buchungen!G:G,\"Sonstiges\"),\"\",A263+MATCH(\"Sonstiges\",INDIRECT(\"Buchungen!G\"&A263+1&\":G\"&65536-A263),0))","v":""}]
[{"$f":"IF(ROW()>COUNTIF(Buchungen!G:G,\"Sonstiges\"),\"\",A264+MATCH(\"Sonstiges\",INDIRECT(\"Buchungen!G\"&A264+1&\":G\"&65536-A264),0))","v":""}]
[{"$f":"IF(ROW()>COUNTIF(Buchungen!G:G,\"Sonstiges\"),\"\",A265+MATCH(\"Sonstiges\",INDIRECT(\"Buchungen!G\"&A265+1&\":G\"&65536-A265),0))","v":""}]
[{"$f":"IF(ROW()>COUNTIF(Buchungen!G:G,\"Sonstiges\"),\"\",A266+MATCH(\"Sonstiges\",INDIRECT(\"Buchungen!G\"&A266+1&\":G\"&65536-A266),0))","v":""}]
[{"$f":"IF(ROW()>COUNTIF(Buchungen!G:G,\"Sonstiges\"),\"\",A267+MATCH(\"Sonstiges\",INDIRECT(\"Buchungen!G\"&A267+1&\":G\"&65536-A267),0))","v":""}]
[{"$f":"IF(ROW()>COUNTIF(Buchungen!G:G,\"Sonstiges\"),\"\",A268+MATCH(\"Sonstiges\",INDIRECT(\"Buchungen!G\"&A268+1&\":G\"&65536-A268),0))","v":""}]
[{"$f":"IF(ROW()>COUNTIF(Buchungen!G:G,\"Sonstiges\"),\"\",A269+MATCH(\"Sonstiges\",INDIRECT(\"Buchungen!G\"&A269+1&\":G\"&65536-A269),0))","v":""}]
[{"$f":"IF(ROW()>COUNTIF(Buchungen!G:G,\"Sonstiges\"),\"\",A270+MATCH(\"Sonstiges\",INDIRECT(\"Buchungen!G\"&A270+1&\":G\"&65536-A270),0))","v":""}]
[{"$f":"IF(ROW()>COUNTIF(Buchungen!G:G,\"Sonstiges\"),\"\",A271+MATCH(\"Sonstiges\",INDIRECT(\"Buchungen!G\"&A271+1&\":G\"&65536-A271),0))","v":""}]
[{"$f":"IF(ROW()>COUNTIF(Buchungen!G:G,\"Sonstiges\"),\"\",A272+MATCH(\"Sonstiges\",INDIRECT(\"Buchungen!G\"&A272+1&\":G\"&65536-A272),0))","v":""}]
[{"$f":"IF(ROW()>COUNTIF(Buchungen!G:G,\"Sonstiges\"),\"\",A273+MATCH(\"Sonstiges\",INDIRECT(\"Buchungen!G\"&A273+1&\":G\"&65536-A273),0))","v":""}]
[{"$f":"IF(ROW()>COUNTIF(Buchungen!G:G,\"Sonstiges\"),\"\",A274+MATCH(\"Sonstiges\",INDIRECT(\"Buchungen!G\"&A274+1&\":G\"&65536-A274),0))","v":""}]
[{"$f":"IF(ROW()>COUNTIF(Buchungen!G:G,\"Sonstiges\"),\"\",A275+MATCH(\"Sonstiges\",INDIRECT(\"Buchungen!G\"&A275+1&\":G\"&65536-A275),0))","v":""}]
[{"$f":"IF(ROW()>COUNTIF(Buchungen!G:G,\"Sonstiges\"),\"\",A276+MATCH(\"Sonstiges\",INDIRECT(\"Buchungen!G\"&A276+1&\":G\"&65536-A276),0))","v":""}]
[{"$f":"IF(ROW()>COUNTIF(Buchungen!G:G,\"Sonstiges\"),\"\",A277+MATCH(\"Sonstiges\",INDIRECT(\"Buchungen!G\"&A277+1&\":G\"&65536-A277),0))","v":""}]
[{"$f":"IF(ROW()>COUNTIF(Buchungen!G:G,\"Sonstiges\"),\"\",A278+MATCH(\"Sonstiges\",INDIRECT(\"Buchungen!G\"&A278+1&\":G\"&65536-A278),0))","v":""}]
[{"$f":"IF(ROW()>COUNTIF(Buchungen!G:G,\"Sonstiges\"),\"\",A279+MATCH(\"Sonstiges\",INDIRECT(\"Buchungen!G\"&A279+1&\":G\"&65536-A279),0))","v":""}]
[{"$f":"IF(ROW()>COUNTIF(Buchungen!G:G,\"Sonstiges\"),\"\",A280+MATCH(\"Sonstiges\",INDIRECT(\"Buchungen!G\"&A280+1&\":G\"&65536-A280),0))","v":""}]
[{"$f":"IF(ROW()>COUNTIF(Buchungen!G:G,\"Sonstiges\"),\"\",A281+MATCH(\"Sonstiges\",INDIRECT(\"Buchungen!G\"&A281+1&\":G\"&65536-A281),0))","v":""}]
[{"$f":"IF(ROW()>COUNTIF(Buchungen!G:G,\"Sonstiges\"),\"\",A282+MATCH(\"Sonstiges\",INDIRECT(\"Buchungen!G\"&A282+1&\":G\"&65536-A282),0))","v":""}]
[{"$f":"IF(ROW()>COUNTIF(Buchungen!G:G,\"Sonstiges\"),\"\",A283+MATCH(\"Sonstiges\",INDIRECT(\"Buchungen!G\"&A283+1&\":G\"&65536-A283),0))","v":""}]
[{"$f":"IF(ROW()>COUNTIF(Buchungen!G:G,\"Sonstiges\"),\"\",A284+MATCH(\"Sonstiges\",INDIRECT(\"Buchungen!G\"&A284+1&\":G\"&65536-A284),0))","v":""}]
[{"$f":"IF(ROW()>COUNTIF(Buchungen!G:G,\"Sonstiges\"),\"\",A285+MATCH(\"Sonstiges\",INDIRECT(\"Buchungen!G\"&A285+1&\":G\"&65536-A285),0))","v":""}]
[{"$f":"IF(ROW()>COUNTIF(Buchungen!G:G,\"Sonstiges\"),\"\",A286+MATCH(\"Sonstiges\",INDIRECT(\"Buchungen!G\"&A286+1&\":G\"&65536-A286),0))","v":""}]
[{"$f":"IF(ROW()>COUNTIF(Buchungen!G:G,\"Sonstiges\"),\"\",A287+MATCH(\"Sonstiges\",INDIRECT(\"Buchungen!G\"&A287+1&\":G\"&65536-A287),0))","v":""}]
[{"$f":"IF(ROW()>COUNTIF(Buchungen!G:G,\"Sonstiges\"),\"\",A288+MATCH(\"Sonstiges\",INDIRECT(\"Buchungen!G\"&A288+1&\":G\"&65536-A288),0))","v":""}]
[{"$f":"IF(ROW()>COUNTIF(Buchungen!G:G,\"Sonstiges\"),\"\",A289+MATCH(\"Sonstiges\",INDIRECT(\"Buchungen!G\"&A289+1&\":G\"&65536-A289),0))","v":""}]
[{"$f":"IF(ROW()>COUNTIF(Buchungen!G:G,\"Sonstiges\"),\"\",A290+MATCH(\"Sonstiges\",INDIRECT(\"Buchungen!G\"&A290+1&\":G\"&65536-A290),0))","v":""}]
[{"$f":"IF(ROW()>COUNTIF(Buchungen!G:G,\"Sonstiges\"),\"\",A291+MATCH(\"Sonstiges\",INDIRECT(\"Buchungen!G\"&A291+1&\":G\"&65536-A291),0))","v":""}]
[{"$f":"IF(ROW()>COUNTIF(Buchungen!G:G,\"Sonstiges\"),\"\",A292+MATCH(\"Sonstiges\",INDIRECT(\"Buchungen!G\"&A292+1&\":G\"&65536-A292),0))","v":""}]
[{"$f":"IF(ROW()>COUNTIF(Buchungen!G:G,\"Sonstiges\"),\"\",A293+MATCH(\"Sonstiges\",INDIRECT(\"Buchungen!G\"&A293+1&\":G\"&65536-A293),0))","v":""}]
[{"$f":"IF(ROW()>COUNTIF(Buchungen!G:G,\"Sonstiges\"),\"\",A294+MATCH(\"Sonstiges\",INDIRECT(\"Buchungen!G\"&A294+1&\":G\"&65536-A294),0))","v":""}]
[{"$f":"IF(ROW()>COUNTIF(Buchungen!G:G,\"Sonstiges\"),\"\",A295+MATCH(\"Sonstiges\",INDIRECT(\"Buchungen!G\"&A295+1&\":G\"&65536-A295),0))","v":""}]
[{"$f":"IF(ROW()>COUNTIF(Buchungen!G:G,\"Sonstiges\"),\"\",A296+MATCH(\"Sonstiges\",INDIRECT(\"Buchungen!G\"&A296+1&\":G\"&65536-A296),0))","v":""}]
[{"$f":"IF(ROW()>COUNTIF(Buchungen!G:G,\"Sonstiges\"),\"\",A297+MATCH(\"Sonstiges\",INDIRECT(\"Buchungen!G\"&A297+1&\":G\"&65536-A297),0))","v":""}]
[{"$f":"IF(ROW()>COUNTIF(Buchungen!G:G,\"Sonstiges\"),\"\",A298+MATCH(\"Sonstiges\",INDIRECT(\"Buchungen!G\"&A298+1&\":G\"&65536-A298),0))","v":""}]
[{"$f":"IF(ROW()>COUNTIF(Buchungen!G:G,\"Sonstiges\"),\"\",A299+MATCH(\"Sonstiges\",INDIRECT(\"Buchungen!G\"&A299+1&\":G\"&65536-A299),0))","v":""}]
[{"$f":"IF(ROW()>COUNTIF(Buchungen!G:G,\"Sonstiges\"),\"\",A300+MATCH(\"Sonstiges\",INDIRECT(\"Buchungen!G\"&A300+1&\":G\"&65536-A300),0))","v":""}]
[{"$f":"IF(ROW()>COUNTIF(Buchungen!G:G,\"Sonstiges\"),\"\",A301+MATCH(\"Sonstiges\",INDIRECT(\"Buchungen!G\"&A301+1&\":G\"&65536-A301),0))","v":""}]
[{"$f":"IF(ROW()>COUNTIF(Buchungen!G:G,\"Sonstiges\"),\"\",A302+MATCH(\"Sonstiges\",INDIRECT(\"Buchungen!G\"&A302+1&\":G\"&65536-A302),0))","v":""}]
[{"$f":"IF(ROW()>COUNTIF(Buchungen!G:G,\"Sonstiges\"),\"\",A303+MATCH(\"Sonstiges\",INDIRECT(\"Buchungen!G\"&A303+1&\":G\"&65536-A303),0))","v":""}]
[{"$f":"IF(ROW()>COUNTIF(Buchungen!G:G,\"Sonstiges\"),\"\",A304+MATCH(\"Sonstiges\",INDIRECT(\"Buchungen!G\"&A304+1&\":G\"&65536-A304),0))","v":""}]
[{"$f":"IF(ROW()>COUNTIF(Buchungen!G:G,\"Sonstiges\"),\"\",A305+MATCH(\"Sonstiges\",INDIRECT(\"Buchungen!G\"&A305+1&\":G\"&65536-A305),0))","v":""}]
[{"$f":"IF(ROW()>COUNTIF(Buchungen!G:G,\"Sonstiges\"),\"\",A306+MATCH(\"Sonstiges\",INDIRECT(\"Buchungen!G\"&A306+1&\":G\"&65536-A306),0))","v":""}]
[{"$f":"IF(ROW()>COUNTIF(Buchungen!G:G,\"Sonstiges\"),\"\",A307+MATCH(\"Sonstiges\",INDIRECT(\"Buchungen!G\"&A307+1&\":G\"&65536-A307),0))","v":""}]
[{"$f":"IF(ROW()>COUNTIF(Buchungen!G:G,\"Sonstiges\"),\"\",A308+MATCH(\"Sonstiges\",INDIRECT(\"Buchungen!G\"&A308+1&\":G\"&65536-A308),0))","v":""}]
[{"$f":"IF(ROW()>COUNTIF(Buchungen!G:G,\"Sonstiges\"),\"\",A309+MATCH(\"Sonstiges\",INDIRECT(\"Buchungen!G\"&A309+1&\":G\"&65536-A309),0))","v":""}]
[{"$f":"IF(ROW()>COUNTIF(Buchungen!G:G,\"Sonstiges\"),\"\",A310+MATCH(\"Sonstiges\",INDIRECT(\"Buchungen!G\"&A310+1&\":G\"&65536-A310),0))","v":""}]
[{"$f":"IF(ROW()>COUNTIF(Buchungen!G:G,\"Sonstiges\"),\"\",A311+MATCH(\"Sonstiges\",INDIRECT(\"Buchungen!G\"&A311+1&\":G\"&65536-A311),0))","v":""}]
[{"$f":"IF(ROW()>COUNTIF(Buchungen!G:G,\"Sonstiges\"),\"\",A312+MATCH(\"Sonstiges\",INDIRECT(\"Buchungen!G\"&A312+1&\":G\"&65536-A312),0))","v":""}]
[{"$f":"IF(ROW()>COUNTIF(Buchungen!G:G,\"Sonstiges\"),\"\",A313+MATCH(\"Sonstiges\",INDIRECT(\"Buchungen!G\"&A313+1&\":G\"&65536-A313),0))","v":""}]
[{"$f":"IF(ROW()>COUNTIF(Buchungen!G:G,\"Sonstiges\"),\"\",A314+MATCH(\"Sonstiges\",INDIRECT(\"Buchungen!G\"&A314+1&\":G\"&65536-A314),0))","v":""}]
[{"$f":"IF(ROW()>COUNTIF(Buchungen!G:G,\"Sonstiges\"),\"\",A315+MATCH(\"Sonstiges\",INDIRECT(\"Buchungen!G\"&A315+1&\":G\"&65536-A315),0))","v":""}]
[{"$f":"IF(ROW()>COUNTIF(Buchungen!G:G,\"Sonstiges\"),\"\",A316+MATCH(\"Sonstiges\",INDIRECT(\"Buchungen!G\"&A316+1&\":G\"&65536-A316),0))","v":""}]
[{"$f":"IF(ROW()>COUNTIF(Buchungen!G:G,\"Sonstiges\"),\"\",A317+MATCH(\"Sonstiges\",INDIRECT(\"Buchungen!G\"&A317+1&\":G\"&65536-A317),0))","v":""}]
[{"$f":"IF(ROW()>COUNTIF(Buchungen!G:G,\"Sonstiges\"),\"\",A318+MATCH(\"Sonstiges\",INDIRECT(\"Buchungen!G\"&A318+1&\":G\"&65536-A318),0))","v":""}]
[{"$f":"IF(ROW()>COUNTIF(Buchungen!G:G,\"Sonstiges\"),\"\",A319+MATCH(\"Sonstiges\",INDIRECT(\"Buchungen!G\"&A319+1&\":G\"&65536-A319),0))","v":""}]
[{"$f":"IF(ROW()>COUNTIF(Buchungen!G:G,\"Sonstiges\"),\"\",A320+MATCH(\"Sonstiges\",INDIRECT(\"Buchungen!G\"&A320+1&\":G\"&65536-A320),0))","v":""}]
[{"$f":"IF(ROW()>COUNTIF(Buchungen!G:G,\"Sonstiges\"),\"\",A321+MATCH(\"Sonstiges\",INDIRECT(\"Buchungen!G\"&A321+1&\":G\"&65536-A321),0))","v":""}]
[{"$f":"IF(ROW()>COUNTIF(Buchungen!G:G,\"Sonstiges\"),\"\",A322+MATCH(\"Sonstiges\",INDIRECT(\"Buchungen!G\"&A322+1&\":G\"&65536-A322),0))","v":""}]
[{"$f":"IF(ROW()>COUNTIF(Buchungen!G:G,\"Sonstiges\"),\"\",A323+MATCH(\"Sonstiges\",INDIRECT(\"Buchungen!G\"&A323+1&\":G\"&65536-A323),0))","v":""}]
[{"$f":"IF(ROW()>COUNTIF(Buchungen!G:G,\"Sonstiges\"),\"\",A324+MATCH(\"Sonstiges\",INDIRECT(\"Buchungen!G\"&A324+1&\":G\"&65536-A324),0))","v":""}]
[{"$f":"IF(ROW()>COUNTIF(Buchungen!G:G,\"Sonstiges\"),\"\",A325+MATCH(\"Sonstiges\",INDIRECT(\"Buchungen!G\"&A325+1&\":G\"&65536-A325),0))","v":""}]

{"sheet":"Daten","index":2,"n_rows":6,"n_cols":13,"rows_kept":6,"cut":false,"hidden":false,"merged":[]}
[null,"Kurse",null,null,null,null,null,"Hoch/Tief",null,null,null,"Volumen"]
["DE000ENAG999"," 22,955 EUR",null,null,null,"Vortag","Eröff.","Tag",null,"52-Wochen",null,"letztes","gesamt"]
[null,null,0.09,3.8999999999999998E-3,"RealPush-Chart",22.864999999999998,22.97,23.055,22.864999999999998,29.68,20.86,1023131,3655972]
[null,"Kurse",null,null,null,null,null,"Hoch/Tief",null,null,null,"Volumen"]
["US0378331005"," 247,800 EUR",null,null,null,"Vortag","Eröff.","Tag",null,"52-Wochen",null,"letztes","gesamt"]
[null,null,-0.9,-3.5999999999999999E-3,"RealPush-Chart",248.7,248.25,248.55,247.5,249,137.5,70,6398]

{"sheet":"Buchungen","index":3,"n_rows":13,"n_cols":7,"rows_kept":13,"cut":false,"hidden":false,"merged":[]}
["Datum","ISIN","Name","Art","Anzahl","Betrag","Risiko"]
["2010-01-19","DE0002635307",275,"A","Kauf",-7111.5,"ETF-Depot"]
["2010-01-19","DE0002635307",275,"A","Gebühren",-23.68,"Dividendendepot"]
["2010-01-20","FR0010168773",21,"B","Kauf",-3133.2,"Sonstiges"]
["2010-01-20","FR0010168773",21,"B","Gebühren",-13.73,"Sonstiges"]
["2010-01-20","FR0010168781",22,"C","Kauf",-2494.8000000000002,"Dividendendepot"]
["2010-01-20","FR0010168781",22,"C","Gebühren",-12.14,"Dividendendepot"]
["2010-01-21","DE0002643889",553,"D","Kauf",-4468.24,"Dividendendepot"]
["2010-01-21","DE0002643889",553,"D","Gebühren",-17.07,"Dividendendepot"]
["2010-01-21","FR0010245514",64,"E","Kauf",-4694.3999999999996,"Sonstiges"]
["2010-01-21","FR0010245514",64,"E","Gebühren",-17.64,"Sonstiges"]
["2010-01-22","FR0010429068",800,"F","Kauf",-5512,"Dividendendepot"]
["2010-01-22","FR0010429068",800,"F","Gebühren",-19.68,"Dividendendepot"]