{"text_format":"1","workbook":"xlsx","n_sheets":4,"sheets":["Depot","Sonstiges","Daten","Buchungen"],"not_rendered":{"charts":0,"images":1,"macros":1,"external_links":0,"defined_names":2,"comments":0,"pivot_tables":0},"unopened":[],"bounds":{"document_bytes":16777216,"sheet_cells":100000,"rows_first":2000,"rows_last":500,"rows_between":2000,"halvings":0,"cell_chars":16384,"cell_head_chars":4096},"cells_cut":0,"cells_raw":0,"read":"whole","date_system":"1900"}

{"sheet":"Depot","index":0,"n_rows":13,"n_cols":12,"rows_kept":13,"cut":false,"hidden":false,"merged":[[0,8,0,9]]}
["ISIN","Name","Stk.","Kaufkurs","Kaufvolumen","Gebühren","akt. Kurs","Volumen","Entwicklung",null,"Ausschüttungen","Rendite p.a."]
["Sonstiges"]
["US0378331005","Apple",14,{"$f":"(E3-F3)/C3","v":213.18428571428572},2972.2,-12.38,{"$f":"LEFT(VLOOKUP(A3,Daten!$1:$1048576,2),LEN(VLOOKUP(A3,Daten!$1:$1048576,2))-4)*1","v":247.8},{"$f":"C3*G3","v":3469.2000000000003},{"$f":"H3-(C3*D3)","v":484.62000000000035},{"$f":"H3/(C3*D3)-1","v":0.1623746054721269}]
["Dividendenstrategie"]
[]
["RK 3"]
["DE000ENAG999","E.ON AG",null,null,null,null,{"$f":"LEFT(VLOOKUP(A7,Daten!$1:$1048576,2),LEN(VLOOKUP(A7,Daten!$1:$1048576,2))-4)*1","v":22.954999999999998}]
["RK 2",null,null,null,null,null,{"$f":"LEFT(Daten!B3,LEN(Daten!B3)-4)*1","v":{"$error":"#VALUE!"}}]
[1234567890,"ABC",{"$f":"SUMIFS(Buchungen!E:E,Buchungen!B:B,Depot!A9,Buchungen!D:D,\"Kauf\")","v":0}]
[124,null,{"$f":"SUMIFS(Buchungen!E:E,Buchungen!B:B,Depot!A10,Buchungen!D:D,\"Kauf\")","v":0}]
[12345,null,{"$f":"SUMIFS(Buchungen!E:E,Buchungen!B:B,Depot!A11,Buchungen!D:D,\"Kauf\")","v":0}]
[123,null,{"$f":"SUMIFS(Buchungen!E:E,Buchungen!B:B,Depot!A12,Buchungen!D:D,\"Kauf\")","v":0}]
["RK 1",null,{"$f":"SUMIFS(Buchungen!E:E,Buchungen!B:B,Depot!A13,Buchungen!D:D,\"Kauf\")","v":0}]

{"sheet":"Sonstiges","index":1,"n_rows":326,"n_cols":7,"rows_kept":326,"cut":false,"hidden":false,"merged":[]}
[null,"Datum","ISIN","Name","Art","Anzahl","Betrag"]
[{"$f":"MATCH(\"Sonstiges\",Buchungen!G:G,0)","v":4},{"$f":"IF($A2=\"\",\"\",INDEX(Buchungen!A:A,$A2))","v":"2010-01-20"},{"$f":"IF($A2=\"\",\"\",INDEX(Buchungen!B:B,$A2))","v":"FR0010168773"},{"$f":"IF($A2=\"\",\"\",INDEX(Buchungen!C:C,$A2))","v":21},{"$f":"IF($A2=\"\",\"\",INDEX(Buchungen!D:D,$A2))","v":"B"},{"$f":"IF($A2=\"\",\"\",INDEX(Buchungen!E:E,$A2))","v":"Kauf"},{"$f":"IF($A2=\"\",\"\",INDEX(Buchungen!F:F,$A2))","v":-3133.2}]
[{"$f":"IF(ROW()>COUNTIF(Buchungen!G:G,\"Sonstiges\"),\"\",A2+MATCH(\"Sonstiges\",INDIRECT(\"Buchungen!G\"&A2+1&\":G\"&65536-A2),0))","v":5},{"$f":"IF($A3=\"\",\"\",INDEX(Buchungen!A:A,$A3))","v":"2010-01-20"},{"$f":"IF($A3=\"\",\"\",INDEX(Buchungen!B:B,$A3))","v":"FR0010168773"},{"$f":"IF($A3=\"\",\"\",INDEX(Buchungen!C:C,$A3))","v":21},{"$f":"IF($A3=\"\",\"\",INDEX(Buchungen!D:D,$A3))","v":"B"},{"$f":"IF($A3=\"\",\"\",INDEX(Buchungen!E:E,$A3))","v":"Gebühren"},{"$f":"IF($A3=\"\",\"\",INDEX(Buchungen!F:F,$A3))","v":-13.73}]
[{"$f":"IF(ROW()>COUNTIF(Buchungen!G:G,\"Sonstiges\"),\"\",A3+MATCH(\"Sonstiges\",INDIRECT(\"Buchungen!G\"&A3+1&\":G\"&65536-A3),0))","v":10},{"$f":"IF($A4=\"\",\"\",INDEX(Buchungen!A:A,$A4))","v":"2010-01-21"},{"$f":"IF($A4=\"\",\"\",INDEX(Buchungen!B:B,$A4))","v":"FR0010245514"},{"$f":"IF($A4=\"\",\"\",INDEX(Buchungen!C:C,$A4))","v":64},{"$f":"IF($A4=\"\",\"\",INDEX(Buchungen!D:D,$A4))","v":"E"},{"$f":"IF($A4=\"\",\"\",INDEX(Buchungen!E:E,$A4))","v":"Kauf"},{"$f":"IF($A4=\"\",\"\",INDEX(Buchungen!F:F,$A4))","v":-4694.3999999999996}]
[{"$f":"IF(ROW()>COUNTIF(Buchungen!G:G,\"Sonstiges\"),\"\",A4+MATCH(\"Sonstiges\",INDIRECT(\"Buchungen!G\"&A4+1&\":G\"&65536-A4),0))","v":""},{"$f":"IF($A5=\"\",\"\",INDEX(Buchungen!A:A,$A5))","v":""},{"$f":"IF($A5=\"\",\"\",INDEX(Buchungen!B:B,$A5))","v":""},{"$f":"IF($A5=\"\",\"\",INDEX(Buchungen!C:C,$A5))","v":""},{"$f":"IF($A5=\"\",\"\",INDEX(Buchungen!D:D,$A5))","v":""},{"$f":"IF($A5=\"\",\"\",INDEX(Buchungen!E:E,$A5))","v":""},{"$f":"IF($A5=\"\",\"\",INDEX(Buchungen!F:F,$A5))","v":""}]
[{"$f":"IF(ROW()>COUNTIF(Buchungen!G:G,\"Sonstiges\"),\"\",A5+MATCH(\"Sonstiges\",INDIRECT(\"Buchungen!G\"&A5+1&\":G\"&65536-A5),0))","v":""},{"$f":"IF($A6=\"\",\"\",INDEX(Buchungen!A:A,$A6))","v":""},{"$f":"IF($A6=\"\",\"\",INDEX(Buchungen!B:B,$A6))","v":""},{"$f":"IF($A6=\"\",\"\",INDEX(Buchungen!C:C,$A6))","v":""},{"$f":"IF($A6=\"\",\"\",INDEX(Buchungen!D:D,$A6))","v":""},{"$f":"IF($A6=\"\",\"\",INDEX(Buchungen!E:E,$A6))","v":""},{"$f":"IF($A6=\"\",\"\",INDEX(Buchungen!F:F,$A6))","v":""}]
[{"$f":"IF(ROW()>COUNTIF(Buchungen!G:G,\"Sonstiges\"),\"\",A6+MATCH(\"Sonstiges\",INDIRECT(\"Buchungen!G\"&A6+1&\":G\"&65536-A6),0))","v":""},{"$f":"IF($A7=\"\",\"\",INDEX(Buchungen!A:A,$A7))","v":""},{"$f":"IF($A7=\"\",\"\",INDEX(Buchungen!B:B,$A7))","v":""},{"$f":"IF($A7=\"\",\"\",INDEX(Buchungen!C:C,$A7))","v":""},{"$f":"IF($A7=\"\",\"\",INDEX(Buchungen!D:D,$A7))","v":""},{"$f":"IF($A7=\"\",\"\",INDEX(Buchungen!E:E,$A7))","v":""},{"$f":"IF($A7=\"\",\"\",INDEX(Buchungen!F:F,$A7))","v":""}]
[{"$f":"IF(ROW()>COUNTIF(Buchungen!G:G,\"Sonstiges\"),\"\",A7+MATCH(\"Sonstiges\",INDIRECT(\"Buchungen!G\"&A7+1&\":G\"&65536-A7),0))","v":""},{"$f":"IF($A8=\"\",\"\",INDEX(Buchungen!A:A,$A8))","v":""},{"$f":"IF($A8=\"\",\"\",INDEX(Buchungen!B:B,$A8))","v":""},{"$f":"IF($A8=\"\",\"\",INDEX(Buchungen!C:C,$A8))","v":""},{"$f":"IF($A8=\"\",\"\",INDEX(Buchungen!D:D,$A8))","v":""},{"$f":"IF($A8=\"\",\"\",INDEX(Buchungen!E:E,$A8))","v":""},{"$f":"IF($A8=\"\",\"\",INDEX(Buchungen!F:F,$A8))","v":""}]
[{"$f":"IF(ROW()>COUNTIF(Buchungen!G:G,\"Sonstiges\"),\"\",A8+MATCH(\"Sonstiges\",INDIRECT(\"Buchungen!G\"&A8+1&\":G\"&65536-A8),0))","v":""},{"$f":"IF($A9=\"\",\"\",INDEX(Buchungen!A:A,$A9))","v":""},{"$f":"IF($A9=\"\",\"\",INDEX(Buchungen!B:B,$A9))","v":""},{"$f":"IF($A9=\"\",\"\",INDEX(Buchungen!C:C,$A9))","v":""},{"$f":"IF($A9=\"\",\"\",INDEX(Buchungen!D:D,$A9))","v":""},{"$f":"IF($A9=\"\",\"\",INDEX(Buchungen!E:E,$A9))","v":""},{"$f":"IF($A9=\"\",\"\",INDEX(Buchungen!F:F,$A9))","v":""}]
[{"$f":"IF(ROW()>COUNTIF(Buchungen!G:G,\"Sonstiges\"),\"\",A9+MATCH(\"Sonstiges\",INDIRECT(\"Buchungen!G\"&A9+1&\":G\"&65536-A9),0))","v":""},{"$f":"IF($A10=\"\",\"\",INDEX(Buchungen!A:A,$A10))","v":""},{"$f":"IF($A10=\"\",\"\",INDEX(Buchungen!B:B,$A10))","v":""},{"$f":"IF($A10=\"\",\"\",INDEX(Buchungen!C:C,$A10))","v":""},{"$f":"IF($A10=\"\",\"\",INDEX(Buchungen!D:D,$A10))","v":""},{"$f":"IF($A10=\"\",\"\",INDEX(Buchungen!E:E,$A10))","v":""},{"$f":"IF($A10=\"\",\"\",INDEX(Buchungen!F:F,$A10))","v":""}]
[{"$f":"IF(ROW()>COUNTIF(Buchungen!G:G,\"Sonstiges\"),\"\",A10+MATCH(\"Sonstiges\",INDIRECT(\"Buchungen!G\"&A10+1&\":G\"&65536-A10),0))","v":""},{"$f":"IF($A11=\"\",\"\",INDEX(Buchungen!A:A,$A11))","v":""},{"$f":"IF($A11=\"\",\"\",INDEX(Buchungen!B:B,$A11))","v":""},{"$f":"IF($A11=\"\",\"\",INDEX(Buchungen!C:C,$A11))","v":""},{"$f":"IF($A11=\"\",\"\",INDEX(Buchungen!D:D,$A11))","v":""},{"$f":"IF($A11=\"\",\"\",INDEX(Buchungen!E:E,$A11))","v":""},{"$f":"IF($A11=\"\",\"\",INDEX(Buchungen!F:F,$A11))","v":""}]
[{"$f":"IF(ROW()>COUNTIF(Buchungen!G:G,\"Sonstiges\"),\"\",A11+MATCH(\"Sonstiges\",INDIRECT(\"Buchungen!G\"&A11+1&\":G\"&65536-A11),0))","v":""},{"$f":"IF($A12=\"\",\"\",INDEX(Buchungen!A:A,$A12))","v":""},{"$f":"IF($A12=\"\",\"\",INDEX(Buchungen!B:B,$A12))","v":""},{"$f":"IF($A12=\"\",\"\",INDEX(Buchungen!C:C,$A12))","v":""},{"$f":"IF($A12=\"\",\"\",INDEX(Buchungen!D:D,$A12))","v":""},{"$f":"IF($A12=\"\",\"\",INDEX(Buchungen!E:E,$A12))","v":""},{"$f":"IF($A12=\"\",\"\",INDEX(Buchungen!F:F,$A12))","v":""}]
[{"$f":"IF(ROW()>COUNTIF(Buchungen!G:G,\"Sonstiges\"),\"\",A12+MATCH(\"Sonstiges\",INDIRECT(\"Buchungen!G\"&A12+1&\":G\"&65536-A12),0))","v":""},{"$f":"IF($A13=\"\",\"\",INDEX(Buchungen!A:A,$A13))","v":""},{"$f":"IF($A13=\"\",\"\",INDEX(Buchungen!B:B,$A13))","v":""},{"$f":"IF($A13=\"\",\"\",INDEX(Buchungen!C:C,$A13))","v":""},{"$f":"IF($A13=\"\",\"\",INDEX(Buchungen!D:D,$A13))","v":""},{"$f":"IF($A13=\"\",\"\",INDEX(Buchungen!E:E,$A13))","v":""},{"$f":"IF($A13=\"\",\"\",INDEX(Buchungen!F:F,$A13))","v":""}]
[{"$f":"IF(ROW()>COUNTIF(Buchungen!G:G,\"Sonstiges\"),\"\",A13+MATCH(\"Sonstiges\",INDIRECT(\"Buchungen!G\"&A13+1&\":G\"&65536-A13),0))","v":""},{"$f":"IF($A14=\"\",\"\",INDEX(Buchungen!A:A,$A14))","v":""},{"$f":"IF($A14=\"\",\"\",INDEX(Buchungen!B:B,$A14))","v":""},{"$f":"IF($A14=\"\",\"\",INDEX(Buchungen!C:C,$A14))","v":""},{"$f":"IF($A14=\"\",\"\",INDEX(Buchungen!D:D,$A14))","v":""},{"$f":"IF($A14=\"\",\"\",INDEX(Buchungen!E:E,$A14))","v":""},{"$f":"IF($A14=\"\",\"\",INDEX(Buchungen!F:F,$A14))","v":""}]
[{"$f":"IF(ROW()>COUNTIF(Buchungen!G:G,\"Sonstiges\"),\"\",A14+MATCH(\"Sonstiges\",INDIRECT(\"Buchungen!G\"&A14+1&\":G\"&65536-A14),0))","v":""},{"$f":"IF($A15=\"\",\"\",INDEX(Buchungen!A:A,$A15))","v":""},{"$f":"IF($A15=\"\",\"\",INDEX(Buchungen!B:B,$A15))","v":""},{"$f":"IF($A15=\"\",\"\",INDEX(Buchungen!C:C,$A15))","v":""},{"$f":"IF($A15=\"\",\"\",INDEX(Buchungen!D:D,$A15))","v":""},{"$f":"IF($A15=\"\",\"\",INDEX(Buchungen!E:E,$A15))","v":""},{"$f":"IF($A15=\"\",\"\",INDEX(Buchungen!F:F,$A15))","v":""}]
[{"$f":"IF(ROW()>COUNTIF(Buchungen!G:G,\"Sonstiges\"),\"\",A15+MATCH(\"Sonstiges\",INDIRECT(\"Buchungen!G\"&A15+1&\":G\"&65536-A15),0))","v":""},{"$f":"IF($A16=\"\",\"\",INDEX(Buchungen!A:A,$A16))","v":""},{"$f":"IF($A16=\"\",\"\",INDEX(Buchungen!B:B,$A16))","v":""},{"$f":"IF($A16=\"\",\"\",INDEX(Buchungen!C:C,$A16))","v":""},{"$f":"IF($A16=\"\",\"\",INDEX(Buchungen!D:D,$A16))","v":""},{"$f":"IF($A16=\"\",\"\",INDEX(Buchungen!E:E,$A16))","v":""},{"$f":"IF($A16=\"\",\"\",INDEX(Buchungen!F:F,$A16))","v":""}]
[{"$f":"IF(ROW()>COUNTIF(Buchungen!G:G,\"Sonstiges\"),\"\",A16+MATCH(\"Sonstiges\",INDIRECT(\"Buchungen!G\"&A16+1&\":G\"&65536-A16),0))","v":""},{"$f":"IF($A17=\"\",\"\",INDEX(Buchungen!A:A,$A17))","v":""},{"$f":"IF($A17=\"\",\"\",INDEX(Buchungen!B:B,$A17))","v":""},{"$f":"IF($A17=\"\",\"\",INDEX(Buchungen!C:C,$A17))","v":""},{"$f":"IF($A17=\"\",\"\",INDEX(Buchungen!D:D,$A17))","v":""},{"$f":"IF($A17=\"\",\"\",INDEX(Buchungen!E:E,$A17))","v":""},{"$f":"IF($A17=\"\",\"\",INDEX(Buchungen!F:F,$A17))","v":""}]
[{"$f":"IF(ROW()>COUNTIF(Buchungen!G:G,\"Sonstiges\"),\"\",A17+MATCH(\"Sonstiges\",INDIRECT(\"Buchungen!G\"&A17+1&\":G\"&65536-A17),0))","v":""},{"$f":"IF($A18=\"\",\"\",INDEX(Buchungen!A:A,$A18))","v":""},{"$f":"IF($A18=\"\",\"\",INDEX(Buchungen!B:B,$A18))","v":""},{"$f":"IF($A18=\"\",\"\",INDEX(Buchungen!C:C,$A18))","v":""},{"$f":"IF($A18=\"\",\"\",INDEX(Buchungen!D:D,$A18))","v":""},{"$f":"IF($A18=\"\",\"\",INDEX(Buchungen!E:E,$A18))","v":""},{"$f":"IF($A18=\"\",\"\",INDEX(Buchungen!F:F,$A18))","v":""}]
[{"$f":"IF(ROW()>COUNTIF(Buchungen!G:G,\"Sonstiges\"),\"\",A18+MATCH(\"Sonstiges\",INDIRECT(\"Buchungen!G\"&A18+1&\":G\"&65536-A18),0))","v":""},{"$f":"IF($A19=\"\",\"\",INDEX(Buchungen!A:A,$A19))","v":""},{"$f":"IF($A19=\"\",\"\",INDEX(Buchungen!B:B,$A19))","v":""},{"$f":"IF($A19=\"\",\"\",INDEX(Buchungen!C:C,$A19))","v":""},{"$f":"IF($A19=\"\",\"\",INDEX(Buchungen!D:D,$A19))","v":""},{"$f":"IF($A19=\"\",\"\",INDEX(Buchungen!E:E,$A19))","v":""},{"$f":"IF($A19=\"\",\"\",INDEX(Buchungen!F:F,$A19))","v":""}]
[{"$f":"IF(ROW()>COUNTIF(Buchungen!G:G,\"Sonstiges\"),\"\",A19+MATCH(\"Sonstiges\",INDIRECT(\"Buchungen!G\"&A19+1&\":G\"&65536-A19),0))","v":""},{"$f":"IF($A20=\"\",\"\",INDEX(Buchungen!A:A,$A20))","v":""},{"$f":"IF($A20=\"\",\"\",INDEX(Buchungen!B:B,$A20))","v":""},{"$f":"IF($A20=\"\",\"\",INDEX(Buchungen!C:C,$A20))","v":""},{"$f":"IF($A20=\"\",\"\",INDEX(Buchungen!D:D,$A20))","v":""},{"$f":"IF($A20=\"\",\"\",INDEX(Buchungen!E:E,$A20))","v":""},{"$f":"IF($A20=\"\",\"\",INDEX(Buchungen!F:F,$A20))","v":""}]
[{"$f":"IF(ROW()>COUNTIF(Buchungen!G:G,\"Sonstiges\"),\"\",A20+MATCH(\"Sonstiges\",INDIRECT(\"Buchungen!G\"&A20+1&\":G\"&65536-A20),0))","v":""},{"$f":"IF($A21=\"\",\"\",INDEX(Buchungen!A:A,$A21))","v":""},{"$f":"IF($A21=\"\",\"\",INDEX(Buchungen!B:B,$A21))","v":""},{"$f":"IF($A21=\"\",\"\",INDEX(Buchungen!C:C,$A21))","v":""},{"$f":"IF($A21=\"\",\"\",INDEX(Buchungen!D:D,$A21))","v":""},{"$f":"IF($A21=\"\",\"\",INDEX(Buchungen!E:E,$A21))","v":""},{"$f":"IF($A21=\"\",\"\",INDEX(Buchungen!F:F,$A21))","v":""}]
[{"$f":"IF(ROW()>COUNTIF(Buchungen!G:G,\"Sonstiges\"),\"\",A21+MATCH(\"Sonstiges\",INDIRECT(\"Buchungen!G\"&A21+1&\":G\"&65536-A21),0))","v":""},{"$f":"IF($A22=\"\",\"\",INDEX(Buchungen!A:A,$A22))","v":""},{"$f":"IF($A22=\"\",\"\",INDEX(Buchungen!B:B,$A22))","v":""},{"$f":"IF($A22=\"\",\"\",INDEX(Buchungen!C:C,$A22))","v":""},{"$f":"IF($A22=\"\",\"\",INDEX(Buchungen!D:D,$A22))","v":""},{"$f":"IF($A22=\"\",\"\",INDEX(Buchungen!E:E,$A22))","v":""},{"$f":"IF($A22=\"\",\"\",INDEX(Buchungen!F:F,$A22))","v":""}]
[{"$f":"IF(ROW()>COUNTIF(Buchungen!G:G,\"Sonstiges\"),\"\",A22+MATCH(\"Sonstiges\",INDIRECT(\"Buchungen!G\"&A22+1&\":G\"&65536-A22),0))","v":""},{"$f":"IF($A23=\"\",\"\",INDEX(Buchungen!A:A,$A23))","v":""},{"$f":"IF($A23=\"\",\"\",INDEX(Buchungen!B:B,$A23))","v":""},{"$f":"IF($A23=\"\",\"\",INDEX(Buchungen!C:C,$A23))","v":""},{"$f":"IF($A23=\"\",\"\",INDEX(Buchungen!D:D,$A23))","v":""},{"$f":"IF($A23=\"\",\"\",INDEX(Buchungen!E:E,$A23))","v":""},{"$f":"IF($A23=\"\",\"\",INDEX(Buchungen!F:F,$A23))","v":""}]
[{"$f":"IF(ROW()>COUNTIF(Buchungen!G:G,\"Sonstiges\"),\"\",A23+MATCH(\"Sonstiges\",INDIRECT(\"Buchungen!G\"&A23+1&\":G\"&65536-A23),0))","v":""},{"$f":"IF($A24=\"\",\"\",INDEX(Buchungen!A:A,$A24))","v":""},{"$f":"IF($A24=\"\",\"\",INDEX(Buchungen!B:B,$A24))","v":""},{"$f":"IF($A24=\"\",\"\",INDEX(Buchungen!C:C,$A24))","v":""},{"$f":"IF($A24=\"\",\"\",INDEX(Buchungen!D:D,$A24))","v":""},{"$f":"IF($A24=\"\",\"\",INDEX(Buchungen!E:E,$A24))","v":""},{"$f":"IF($A24=\"\",\"\",INDEX(Buchungen!F:F,$A24))","v":""}]
[{"$f":"IF(ROW()>COUNTIF(Buchungen!G:G,\"Sonstiges\"),\"\",A24+MATCH(\"Sonstiges\",INDIRECT(\"Buchungen!G\"&A24+1&\":G\"&65536-A24),0))","v":""},{"$f":"IF($A25=\"\",\"\",INDEX(Buchungen!A:A,$A25))","v":""},{"$f":"IF($A25=\"\",\"\",INDEX(Buchungen!B:B,$A25))","v":""},{"$f":"IF($A25=\"\",\"\",INDEX(Buchungen!C:C,$A25))","v":""},{"$f":"IF($A25=\"\",\"\",INDEX(Buchungen!D:D,$A25))","v":""},{"$f":"IF($A25=\"\",\"\",INDEX(Buchungen!E:E,$A25))","v":""},{"$f":"IF($A25=\"\",\"\",INDEX(Buchungen!F:F,$A25))","v":""}]
[{"$f":"IF(ROW()>COUNTIF(Buchungen!G:G,\"Sonstiges\"),\"\",A25+MATCH(\"Sonstiges\",INDIRECT(\"Buchungen!G\"&A25+1&\":G\"&65536-A25),0))","v":""},{"$f":"IF($A26=\"\",\"\",INDEX(Buchungen!A:A,$A26))","v":""},{"$f":"IF($A26=\"\",\"\",INDEX(Buchungen!B:B,$A26))","v":""},{"$f":"IF($A26=\"\",\"\",INDEX(Buchungen!C:C,$A26))","v":""},{"$f":"IF($A26=\"\",\"\",INDEX(Buchungen!D:D,$A26))","v":""},{"$f":"IF($A26=\"\",\"\",INDEX(Buchungen!E:E,$A26))","v":""},{"$f":"IF($A26=\"\",\"\",INDEX(Buchungen!F:F,$A26))","v":""}]
[{"$f":"IF(ROW()>COUNTIF(Buchungen!G:G,\"Sonstiges\"),\"\",A26+MATCH(\"Sonstiges\",INDIRECT(\"Buchungen!G\"&A26+1&\":G\"&65536-A26),0))","v":""},{"$f":"IF($A27=\"\",\"\",INDEX(Buchungen!A:A,$A27))","v":""},{"$f":"IF($A27=\"\",\"\",INDEX(Buchungen!B:B,$A27))","v":""},{"$f":"IF($A27=\"\",\"\",INDEX(Buchungen!C:C,$A27))","v":""},{"$f":"IF($A27=\"\",\"\",INDEX(Buchungen!D:D,$A27))","v":""},{"$f":"IF($A27=\"\",\"\",INDEX(Buchungen!E:E,$A27))","v":""},{"$f":"IF($A27=\"\",\"\",INDEX(Buchungen!F:F,$A27))","v":""}]
[{"$f":"IF(ROW()>COUNTIF(Buchungen!G:G,\"Sonstiges\"),\"\",A27+MATCH(\"Sonstiges\",INDIRECT(\"Buchungen!G\"&A27+1&\":G\"&65536-A27),0))","v":""},{"$f":"IF($A28=\"\",\"\",INDEX(Buchungen!A:A,$A28))","v":""},{"$f":"IF($A28=\"\",\"\",INDEX(Buchungen!B:B,$A28))","v":""},{"$f":"IF($A28=\"\",\"\",INDEX(Buchungen!C:C,$A28))","v":""},{"$f":"IF($A28=\"\",\"\",INDEX(Buchungen!D:D,$A28))","v":""},{"$f":"IF($A28=\"\",\"\",INDEX(Buchungen!E:E,$A28))","v":""},{"$f":"IF($A28=\"\",\"\",INDEX(Buchungen!F:F,$A28))","v":""}]
[{"$f":"IF(ROW()>COUNTIF(Buchungen!G:G,\"Sonstiges\"),\"\",A28+MATCH(\"Sonstiges\",INDIRECT(\"Buchungen!G\"&A28+1&\":G\"&65536-A28),0))","v":""},{"$f":"IF($A29=\"\",\"\",INDEX(Buchungen!A:A,$A29))","v":""},{"$f":"IF($A29=\"\",\"\",INDEX(Buchungen!B:B,$A29))","v":""},{"$f":"IF($A29=\"\",\"\",INDEX(Buchungen!C:C,$A29))","v":""},{"$f":"IF($A29=\"\",\"\",INDEX(Buchungen!D:D,$A29))","v":""},{"$f":"IF($A29=\"\",\"\",INDEX(Buchungen!E:E,$A29))","v":""},{"$f":"IF($A29=\"\",\"\",INDEX(Buchungen!F:F,$A29))","v":""}]
[{"$f":"IF(ROW()>COUNTIF(Buchungen!G:G,\"Sonstiges\"),\"\",A29+MATCH(\"Sonstiges\",INDIRECT(\"Buchungen!G\"&A29+1&\":G\"&65536-A29),0))","v":""},{"$f":"IF($A30=\"\",\"\",INDEX(Buchungen!A:A,$A30))","v":""},{"$f":"IF($A30=\"\",\"\",INDEX(Buchungen!B:B,$A30))","v":""},{"$f":"IF($A30=\"\",\"\",INDEX(Buchungen!C:C,$A30))","v":""},{"$f":"IF($A30=\"\",\"\",INDEX(Buchungen!D:D,$A30))","v":""},{"$f":"IF($A30=\"\",\"\",INDEX(Buchungen!E:E,$A30))","v":""},{"$f":"IF($A30=\"\",\"\",INDEX(Buchungen!F:F,$A30))","v":""}]
[{"$f":"IF(ROW()>COUNTIF(Buchungen!G:G,\"Sonstiges\"),\"\",A30+MATCH(\"Sonstiges\",INDIRECT(\"Buchungen!G\"&A30+1&\":G\"&65536-A30),0))","v":""},{"$f":"IF($A31=\"\",\"\",INDEX(Buchungen!A:A,$A31))","v":""},{"$f":"IF($A31=\"\",\"\",INDEX(Buchungen!B:B,$A31))","v":""},{"$f":"IF($A31=\"\",\"\",INDEX(Buchungen!C:C,$A31))","v":""},{"$f":"IF($A31=\"\",\"\",INDEX(Buchungen!D:D,$A31))","v":""},{"$f":"IF($A31=\"\",\"\",INDEX(Buchungen!E:E,$A31))","v":""},{"$f":"IF($A31=\"\",\"\",INDEX(Buchungen!F:F,$A31))","v":""}]
[{"$f":"IF(ROW()>COUNTIF(Buchungen!G:G,\"Sonstiges\"),\"\",A31+MATCH(\"Sonstiges\",INDIRECT(\"Buchungen!G\"&A31+1&\":G\"&65536-A31),0))","v":""},{"$f":"IF($A32=\"\",\"\",INDEX(Buchungen!A:A,$A32))","v":""},{"$f":"IF($A32=\"\",\"\",INDEX(Buchungen!B:B,$A32))","v":""},{"$f":"IF($A32=\"\",\"\",INDEX(Buchungen!C:C,$A32))","v":""},{"$f":"IF($A32=\"\",\"\",INDEX(Buchungen!D:D,$A32))","v":""},{"$f":"IF($A32=\"\",\"\",INDEX(Buchungen!E:E,$A32))","v":""},{"$f":"IF($A32=\"\",\"\",INDEX(Buchungen!F:F,$A32))","v":""}]
[{"$f":"IF(ROW()>COUNTIF(Buchungen!G:G,\"Sonstiges\"),\"\",A32+MATCH(\"Sonstiges\",INDIRECT(\"Buchungen!G\"&A32+1&\":G\"&65536-A32),0))","v":""},{"$f":"IF($A33=\"\",\"\",INDEX(Buchungen!A:A,$A33))","v":""},{"$f":"IF($A33=\"\",\"\",INDEX(Buchungen!B:B,$A33))","v":""},{"$f":"IF($A33=\"\",\"\",INDEX(Buchungen!C:C,$A33))","v":""},{"$f":"IF($A33=\"\",\"\",INDEX(Buchungen!D:D,$A33))","v":""},{"$f":"IF($A33=\"\",\"\",INDEX(Buchungen!E:E,$A33))","v":""},{"$f":"IF($A33=\"\",\"\",INDEX(Buchungen!F:F,$A33))","v":""}]
[{"$f":"IF(ROW()>COUNTIF(Buchungen!G:G,\"Sonstiges\"),\"\",A33+MATCH(\"Sonstiges\",INDIRECT(\"Buchungen!G\"&A33+1&\":G\"&65536-A33),0))","v":""},{"$f":"IF($A34=\"\",\"\",INDEX(Buchungen!A:A,$A34))","v":""},{"$f":"IF($A34=\"\",\"\",INDEX(Buchungen!B:B,$A34))","v":""},{"$f":"IF($A34=\"\",\"\",INDEX(Buchungen!C:C,$A34))","v":""},{"$f":"IF($A34=\"\",\"\",INDEX(Buchungen!D:D,$A34))","v":""},{"$f":"IF($A34=\"\",\"\",INDEX(Buchungen!E:E,$A34))","v":""},{"$f":"IF($A34=\"\",\"\",INDEX(Buchungen!F:F,$A34))","v":""}]
[{"$f":"IF(ROW()>COUNTIF(Buchungen!G:G,\"Sonstiges\"),\"\",A34+MATCH(\"Sonstiges\",INDIRECT(\"Buchungen!G\"&A34+1&\":G\"&65536-A34),0))","v":""},{"$f":"IF($A35=\"\",\"\",INDEX(Buchungen!A:A,$A35))","v":""},{"$f":"IF($A35=\"\",\"\",INDEX(Buchungen!B:B,$A35))","v":""},{"$f":"IF($A35=\"\",\"\",INDEX(Buchungen!C:C,$A35))","v":""},{"$f":"IF($A35=\"\",\"\",INDEX(Buchungen!D:D,$A35))","v":""},{"$f":"IF($A35=\"\",\"\",INDEX(Buchungen!E:E,$A35))","v":""},{"$f":"IF($A35=\"\",\"\",INDEX(Buchungen!F:F,$A35))","v":""}]
[{"$f":"IF(ROW()>COUNTIF(Buchungen!G:G,\"Sonstiges\"),\"\",A35+MATCH(\"Sonstiges\",INDIRECT(\"Buchungen!G\"&A35+1&\":G\"&65536-A35),0))","v":""},{"$f":"IF($A36=\"\",\"\",INDEX(Buchungen!A:A,$A36))","v":""},{"$f":"IF($A36=\"\",\"\",INDEX(Buchungen!B:B,$A36))","v":""},{"$f":"IF($A36=\"\",\"\",INDEX(Buchungen!C:C,$A36))","v":""},{"$f":"IF($A36=\"\",\"\",INDEX(Buchungen!D:D,$A36))","v":""},{"$f":"IF($A36=\"\",\"\",INDEX(Buchungen!E:E,$A36))","v":""},{"$f":"IF($A36=\"\",\"\",INDEX(Buchungen!F:F,$A36))","v":""}]
[{"$f":"IF(ROW()>COUNTIF(Buchungen!G:G,\"Sonstiges\"),\"\",A36+MATCH(\"Sonstiges\",INDIRECT(\"Buchungen!G\"&A36+1&\":G\"&65536-A36),0))","v":""},{"$f":"IF($A37=\"\",\"\",INDEX(Buchungen!A:A,$A37))","v":""},{"$f":"IF($A37=\"\",\"\",INDEX(Buchungen!B:B,$A37))","v":""},{"$f":"IF($A37=\"\",\"\",INDEX(Buchungen!C:C,$A37))","v":""},{"$f":"IF($A37=\"\",\"\",INDEX(Buchungen!D:D,$A37))","v":""},{"$f":"IF($A37=\"\",\"\",INDEX(Buchungen!E:E,$A37))","v":""},{"$f":"IF($A37=\"\",\"\",INDEX(Buchungen!F:F,$A37))","v":""}]
[{"$f":"IF(ROW()>COUNTIF(Buchungen!G:G,\"Sonstiges\"),\"\",A37+MATCH(\"Sonstiges\",INDIRECT(\"Buchungen!G\"&A37+1&\":G\"&65536-A37),0))","v":""},{"$f":"IF($A38=\"\",\"\",INDEX(Buchungen!A:A,$A38))","v":""},{"$f":"IF($A38=\"\",\"\",INDEX(Buchungen!B:B,$A38))","v":""},{"$f":"IF($A38=\"\",\"\",INDEX(Buchungen!C:C,$A38))","v":""},{"$f":"IF($A38=\"\",\"\",INDEX(Buchungen!D:D,$A38))","v":""},{"$f":"IF($A38=\"\",\"\",INDEX(Buchungen!E:E,$A38))","v":""},{"$f":"IF($A38=\"\",\"\",INDEX(Buchungen!F:F,$A38))","v":""}]
[{"$f":"IF(ROW()>COUNTIF(Buchungen!G:G,\"Sonstiges\"),\"\",A38+MATCH(\"Sonstiges\",INDIRECT(\"Buchungen!G\"&A38+1&\":G\"&65536-A38),0))","v":""},{"$f":"IF($A39=\"\",\"\",INDEX(Buchungen!A:A,$A39))","v":""},{"$f":"IF($A39=\"\",\"\",INDEX(Buchungen!B:B,$A39))","v":""},{"$f":"IF($A39=\"\",\"\",INDEX(Buchungen!C:C,$A39))","v":""},{"$f":"IF($A39=\"\",\"\",INDEX(Buchungen!D:D,$A39))","v":""},{"$f":"IF($A39=\"\",\"\",INDEX(Buchungen!E:E,$A39))","v":""},{"$f":"IF($A39=\"\",\"\",INDEX(Buchungen!F:F,$A39))","v":""}]
[{"$f":"IF(ROW()>COUNTIF(Buchungen!G:G,\"Sonstiges\"),\"\",A39+MATCH(\"Sonstiges\",INDIRECT(\"Buchungen!G\"&A39+1&\":G\"&65536-A39),0))","v":""},{"$f":"IF($A40=\"\",\"\",INDEX(Buchungen!A:A,$A40))","v":""},{"$f":"IF($A40=\"\",\"\",INDEX(Buchungen!B:B,$A40))","v":""},{"$f":"IF($A40=\"\",\"\",INDEX(Buchungen!C:C,$A40))","v":""},{"$f":"IF($A40=\"\",\"\",INDEX(Buchungen!D:D,$A40))","v":""},{"$f":"IF($A40=\"\",\"\",INDEX(Buchungen!E:E,$A40))","v":""},{"$f":"IF($A40=\"\",\"\",INDEX(Buchungen!F:F,$A40))","v":""}]
{"$rows_left_out":287}
{"sheet":"Daten","index":2,"n_rows":6,"n_cols":13,"rows_kept":6,"cut":false,"hidden":false,"merged":[]}
[null,"Kurse",null,null,null,null,null,"Hoch/Tief",null,null,null,"Volumen"]
["DE000ENAG999"," 22,955 EUR",null,null,null,"Vortag","Eröff.","Tag",null,"52-Wochen",null,"letztes","gesamt"]
[null,null,0.09,3.8999999999999998E-3,"RealPush-Chart",22.864999999999998,22.97,23.055,22.864999999999998,29.68,20.86,1023131,3655972]
[null,"Kurse",null,null,null,null,null,"Hoch/Tief",null,null,null,"Volumen"]
["US0378331005"," 247,800 EUR",null,null,null,"Vortag","Eröff.","Tag",null,"52-Wochen",null,"letztes","gesamt"]
[null,null,-0.9,-3.5999999999999999E-3,"RealPush-Chart",248.7,248.25,248.55,247.5,249,137.5,70,6398]

{"sheet":"Buchungen","index":3,"n_rows":13,"n_cols":7,"rows_kept":13,"cut":false,"hidden":false,"merged":[]}
["Datum","ISIN","Name","Art","Anzahl","Betrag","Risiko"]
["2010-01-19","DE0002635307",275,"A","Kauf",-7111.5,"ETF-Depot"]
["2010-01-19","DE0002635307",275,"A","Gebühren",-23.68,"Dividendendepot"]
["2010-01-20","FR0010168773",21,"B","Kauf",-3133.2,"Sonstiges"]
["2010-01-20","FR0010168773",21,"B","Gebühren",-13.73,"Sonstiges"]
["2010-01-20","FR0010168781",22,"C","Kauf",-2494.8000000000002,"Dividendendepot"]
["2010-01-20","FR0010168781",22,"C","Gebühren",-12.14,"Dividendendepot"]
["2010-01-21","DE0002643889",553,"D","Kauf",-4468.24,"Dividendendepot"]
["2010-01-21","DE0002643889",553,"D","Gebühren",-17.07,"Dividendendepot"]
["2010-01-21","FR0010245514",64,"E","Kauf",-4694.3999999999996,"Sonstiges"]
["2010-01-21","FR0010245514",64,"E","Gebühren",-17.64,"Sonstiges"]
["2010-01-22","FR0010429068",800,"F","Kauf",-5512,"Dividendendepot"]
["2010-01-22","FR0010429068",800,"F","Gebühren",-19.68,"Dividendendepot"]